program: Gaussian 09
title: 000188975
version: EM64L-G09RevD.01
frameworkgroup: C1[X(C4H6O3)]
method: RPBEPBE
basis: SDD
operation: Freq
keyword: #p
keyword: freq=noraman
keyword: PBEPBE/SDD
title: #p freq=noraman PBEPBE/SDD
converged: NO YES NO NO
title: Mulliken charges:
elementType: O O O C C C C H H H H H H
charge: -0.466532 -0.432881 -0.247228 -0.355233 -0.095260 -0.301979 0.186598 0.218555 0.218761 0.291562 0.254721 0.351499 0.377417
chargesum: 0.00000
title: Mulliken charges with hydrogens summed into heavy atoms:
elementType: O O O C C C C
charge: -0.115033 -0.055464 -0.247228 0.082083 0.196302 -0.047258 0.186598
polarizability: 8.65205256e+01 1.17886758e+00 5.17178641e+01 -1.60063101e-02 1.25706750e-02 2.76459601e+01
1716.lowfreq: -65.3563 -2.4992 -0.0011 -0.0010 -0.0009 7.2248 14.0659 120.7015 124.4102
frequency: -65.2544 120.7012 124.4087 195.2833 279.7266 319.9929 352.8973 516.3932 572.1371 597.9255 665.7940 817.2091 903.1836 974.1107 996.6558 1011.5971 1023.7149 1072.1965 1181.4994 1201.6750 1231.0749 1264.0738 1325.5729 1386.8882 1456.8917 1647.7333 1672.3034 2924.4226 2966.7291 3131.3054 3149.8269 3524.6386 3580.3384
redmass: 3.0428 3.1275 6.3873 2.1033 1.1514 4.9874 6.5273 4.0635 1.3300 4.8517 2.1201 2.2819 7.0665 1.2141 6.3006 2.4500 1.5176 1.9122 1.0644 1.2049 1.2383 1.4221 1.9688 1.5315 1.0778 8.5707 6.5684 1.0548 1.1043 1.0926 1.0916 1.0640 1.0666
irintensity: 8.8821 5.5044 0.6523 24.9269 153.8937 5.6340 4.6508 52.7096 86.6088 14.4808 94.1138 4.1333 46.0533 40.5020 20.0484 106.7736 22.3362 292.4524 0.2300 7.9097 66.4545 21.7106 58.3309 33.9130 24.2968 241.1010 67.7679 43.0750 46.4051 0.4531 6.1855 38.6790 6.4653
temp: 298.150 k
press: 1.00000 atm
elementType: 8 8 8 6 6 6 6 1 1 1 1 1 1
symmnumber: 1
zpe: 252345.7 jmol-1
zpe.correction: 0.096113 hartree
zpe.thermalcorrener: 0.103168 hartree
zpe.thermalcorrenthalpy: 0.104112 hartree
zpe.thermalcorrgfe: 0.064657 hartree
zpe.sumelectzpe: -381.118830 hartree
zpe.sumelectthermal: -381.111776 hartree
zpe.sumelectthermalent: -381.110831 hartree
zpe.sumelectthermalfe: -381.150287 hartree
dipole: 1.9010 -3.3002 -0.0065
dipole: 3.8085
quadrupole: -26.6649 -45.9838 -42.0270
quadrupole: -4.5246 -0.0494 0.0007
quadrupole: 11.5604 -7.7586 -3.8018 -4.5246 -0.0494 0.0007
hfenergy: -381.2149437 hartree
pointgroup: C01[X(C4H6O3)]
dipole: -0.784827 -1.2020097 0.4294084 debye
dipolederiv: -0.5569971 0.3056877 -0.1032717 0.377748 -0.4349311 -0.0772436 -0.1265934 -0.0731659 -0.5823797 -1.0540549 0.5453199 -0.1497468 0.4964817 -0.6284627 0.0365758 -0.1333863 0.0338433 -0.4500945 -0.7236648 -0.1526245 0.0673592 -0.1637218 -0.9170044 0.1958138 0.0713043 0.1965822 -0.4031695 0.4704684 -0.2931014 0.092734 -0.4862811 0.3491314 0.0502957 0.1547385 0.0413256 0.4118743 0.4906525 0.0664754 -0.0484177 -0.0462557 0.0473461 -0.0506738 -0.0121014 -0.0560611 -0.0956686 -0.9022114 -0.0861649 0.0592988 0.030921 0.0371425 -0.0831124 0.0208721 -0.0778732 -0.1890172 1.8806079 -0.2009341 -0.0086545 0.0274058 1.2226934 -0.3124103 -0.0832233 -0.3026195 0.365567 -0.0720013 0.0420812 0.00453 0.0754138 0.0141104 0.0831183 0.0055561 0.1045807 -0.1506008 -0.0763207 0.0198684 -0.0250401 0.0482121 -0.1338986 -0.1004897 -0.0453101 -0.1192915 0.0012465 0.1066601 -0.022954 0.0107047 -0.0264757 0.0348977 0.0481671 0.0117621 0.048001 0.1627289 0.0754815 -0.0166874 0.0102497 -0.036825 -0.037317 0.0730655 0.0168829 0.072145 0.1572663 0.0942243 -0.1047886 0.0506123 -0.1537212 0.231363 0.0694135 0.0665736 0.0669392 0.3944625 0.2671554 -0.1021777 0.0396421 -0.1429018 0.2149292 0.0674801 0.0529247 0.0655941 0.377785 unknown
polarizability: 86.3096899|-2.8800538|49.5645849|-1.7557724|-7.008854|30.0100749 unknown
InChI: InChI=1S/C4H6O3/c5-3-1-2-4(6)7/h1-2,5-6H,3H2
charge 0 multiplicity 1
13 atoms
O  -3.208584 0.624185 -0.033821
O  2.639085 -0.837243 0.174413
O  1.796309 1.238949 -0.462302
C  -2.260171 -0.453035 0.272003
C  -0.881497 0.107478 0.027483
C  0.280743 -0.577842 0.198827
C  1.584297 0.066355 -0.069987
H  -2.351769 -0.787037 1.329291
H  -2.429648 -1.339849 -0.378113
H  -0.850368 1.151212 -0.3145
H  0.312899 -1.619249 0.536981
H  -4.135423 0.311281 0.115775
H  3.502428 -0.379805 -0.01545
