program: Gaussian 09
title: 000188973
version: EM64L-G09RevD.01
frameworkgroup: C1[X(C7H10N2O3)]
method: RPBEPBE
basis: SDD
operation: Freq
keyword: #p
keyword: freq=noraman
keyword: PBEPBE/SDD
title: #p freq=noraman PBEPBE/SDD
converged: YES YES NO NO
title: Mulliken charges:
elementType: O O O N N C C C C C C C H H H H H H H H H H
charge: -0.445206 -0.487799 -0.485279 -0.301171 -0.559748 0.348735 -0.509644 -0.003739 -0.354720 0.023940 0.193194 -0.366910 0.232119 0.231250 0.280477 0.222306 0.274233 0.387878 0.397532 0.290396 0.258776 0.373379
chargesum: 0.00000
title: Mulliken charges with hydrogens summed into heavy atoms:
elementType: O O O N N C C C C C C C
charge: -0.057328 -0.090266 -0.111899 -0.026937 -0.010576 0.348735 -0.046275 -0.003739 -0.074244 0.023940 0.193194 -0.144603
polarizability: 1.43960813e+02 -4.21880267e+00 1.11766591e+02 -5.81017319e+00 -1.15035412e+00 5.20219316e+01
1716.lowfreq: -0.0006 0.0005 0.0006 2.6899 5.1736 7.1172 38.4246 88.4601 98.8387
frequency: 38.3472 88.4345 98.8303 156.7967 173.8394 244.6015 260.7426 267.0893 281.7309 302.0941 324.8660 354.5828 401.8756 416.7756 484.2923 492.3790 514.9069 537.7954 578.1974 596.6846 621.9374 680.1225 716.7123 748.7780 754.8833 773.5869 913.7642 929.6445 962.4738 1001.3618 1076.2656 1117.2276 1133.9680 1146.2900 1187.3375 1211.3585 1223.6940 1227.4559 1260.3001 1266.8826 1307.0174 1356.6922 1422.9310 1453.8599 1480.8321 1491.4134 1498.5490 1622.5354 1640.7795 1662.1615 2910.1146 2984.2338 3129.4600 3167.8620 3348.7221 3436.6709 3519.2379 3540.5305 3567.5475 3625.0220
redmass: 3.8349 2.0431 4.8619 8.5185 4.1949 1.3088 4.8127 4.4567 3.1173 4.4021 4.5499 4.6553 1.1458 1.1155 5.9628 1.1456 5.2508 3.9829 4.3904 4.2461 1.7800 6.8328 4.7997 4.7143 1.4121 1.4121 3.6763 1.2793 2.4668 2.3212 2.8103 1.3916 3.0046 1.2984 1.1865 1.8409 2.7352 1.6683 1.4301 1.8660 2.1480 1.4228 5.5510 1.1254 1.1494 3.9169 3.0242 7.6481 7.1671 1.0676 1.0672 1.0915 1.0896 1.0943 1.0493 1.0761 1.0650 1.0918 1.0654 1.0666
irintensity: 1.0520 10.1788 6.7477 0.2466 1.3595 171.5613 5.2029 5.7391 5.0137 5.9378 12.6316 1.3774 23.3072 190.5470 8.1432 107.6433 8.8340 3.0308 5.3402 41.0506 210.2155 15.2565 7.3174 1.3734 97.3107 46.7894 81.5934 4.7560 108.0313 99.4056 21.4543 22.1733 6.5709 9.9861 3.6084 115.6823 7.1308 173.8175 57.8040 156.8655 95.2918 11.7390 0.2551 9.0841 24.2239 60.6163 44.9074 2.2520 50.0617 20.9166 44.0907 29.2910 11.4745 3.4263 26.3757 1.3547 68.0170 1.2913 88.7937 58.3376
temp: 298.150 k
press: 1.00000 atm
elementType: 8 8 8 7 7 6 6 6 6 6 6 6 1 1 1 1 1 1 1 1 1 1
symmnumber: 1
zpe: 447015.0 jmol-1
zpe.correction: 0.170259 hartree
zpe.thermalcorrener: 0.182594 hartree
zpe.thermalcorrenthalpy: 0.183538 hartree
zpe.thermalcorrgfe: 0.132008 hartree
zpe.sumelectzpe: -606.952076 hartree
zpe.sumelectthermal: -606.939741 hartree
zpe.sumelectthermalent: -606.938797 hartree
zpe.sumelectthermalfe: -606.990327 hartree
dipole: 2.3660 -1.0013 0.3650
dipole: 2.5949
quadrupole: -61.7234 -63.7904 -72.5723
quadrupole: -10.0973 -5.1723 -1.1204
quadrupole: 4.3053 2.2383 -6.5436 -10.0973 -5.1723 -1.1204
hfenergy: -607.1223346 hartree
pointgroup: C01 [X(C7H10N2O3)]
dipole: -0.9524536 -0.3645921 -0.0465504 debye
dipolederiv: -0.1872671 -0.2129336 0.0518976 -0.1960651 -1.1894989 0.2812899 0.047194 0.2807276 -0.4974947 -0.8510784 0.5449008 -0.1613433 0.6227186 -0.7184769 0.0640046 -0.178069 0.0640421 -0.4316096 -1.4375316 -0.2866642 0.1444018 -0.2124994 -0.2137297 -0.057696 0.1383934 -0.0500779 -0.4262156 -0.0414953 -0.0431643 -0.0030052 -0.0347521 -0.4468381 0.0715708 -0.0837474 0.0217883 -0.0353775 -0.317104 0.158254 -0.2388869 0.0215382 -0.001686 0.0902979 -0.4182048 0.1045681 -0.5416221 0.0923599 0.0756637 -0.0872403 -0.056394 -0.2015375 0.0686652 -0.1510731 0.0363863 -0.0990202 0.1823041 -0.0886366 0.093128 0.0896821 0.3471916 0.0026314 0.1972436 -0.0218127 0.2891464 0.044493 0.3229291 -0.1116589 0.1169772 1.00893 -0.3448125 -0.0582544 -0.3493085 0.164129 -0.0017257 0.0510036 -0.0331757 0.0560692 0.0299593 -0.0602158 0.0103833 -0.0553271 -0.1424124 0.4260051 -0.6964742 0.1989152 -0.7250042 0.2864495 -0.0470133 0.2224505 -0.0481959 0.0136873 1.164264 0.2498066 -0.1437678 0.3528885 0.1483329 -0.0597606 -0.1889748 -0.0584894 0.0611634 -0.2945008 -0.0472047 0.0175453 0.0901605 -0.076434 -0.0475476 -0.0274024 -0.0440078 -0.1950537 -0.0647326 0.013312 0.0862544 0.0559895 0.0472677 -0.062813 0.0499399 -0.0248121 -0.1167593 -0.0176011 -0.0491756 -0.0156642 -0.0207403 -0.1784027 0.0404561 -0.075149 -0.0051793 0.0387276 0.09053 0.0817091 -0.0113589 0.0880075 0.0405962 0.0325808 -0.008635 0.0370022 0.1436655 0.0196161 -0.0825816 0.0334431 -0.081711 -0.0520186 0.0800297 0.0324909 0.0828297 0.1526516 0.094008 0.021514 0.0535808 0.0858177 0.2149509 -0.1033076 0.036434 -0.0303398 0.0251903 0.1578222 0.0620144 -0.0025263 0.051533 0.4189212 -0.0158487 0.0000912 -0.0182178 0.3922542 0.3291596 -0.122813 0.0463428 -0.1333894 0.3218102 0.0366949 0.0488791 0.0371372 0.3925343 0.1421397 -0.0235571 0.0596259 -0.0631958 0.1499801 -0.1046604 0.2028616 -0.1440783 0.1551057 0.0603294 -0.0113736 0.0491357 -0.144318 -0.0646424 0.0484467 0.2173124 0.1022957 0.2790135 0.4100053 0.0834713 -0.0256431 0.0366873 0.1288755 0.0870074 -0.0141639 0.0830695 0.3782961 unknown
polarizability: 144.6514101|0.6176571|105.1442077|-3.5126161|-18.2362152|57.9537174 unknown
InChI: InChI=1S/C7H10N2O3/c8-9-3-4-1-2-5(10)7(12)6(4)11/h1-2,9-12H,3,8H2
charge 0 multiplicity 1
22 atoms
O  0.146717 2.175851 -0.88485
O  -2.521231 1.686712 -0.551316
O  -3.460734 -0.746124 0.305249
N  3.027256 -0.549767 0.607977
N  4.438633 -0.326152 0.51425
C  0.718371 -0.093529 -0.17574
C  2.196898 0.198751 -0.377285
C  -0.250242 0.906063 -0.440204
C  0.26371 -1.360177 0.26931
C  -1.625248 0.637232 -0.265266
C  -2.054792 -0.628655 0.17725
C  -1.111125 -1.639914 0.450051
H  2.516987 -0.125906 -1.388238
H  2.362489 1.300604 -0.333346
H  1.016238 -2.126704 0.476005
H  -1.435244 -2.628706 0.795693
H  2.71706 -0.38081 1.574268
H  -0.663957 2.738984 -1.002221
H  -3.449382 1.378665 -0.390231
H  4.885352 -1.003976 -0.110136
H  4.716493 0.648346 0.312525
H  -3.722848 -1.646987 0.610253
