program: Gaussian 09
title: 000188959
version: EM64L-G09RevD.01
frameworkgroup: C1[X(C11H15N5O5)]
method: RPBEPBE
basis: SDD
operation: Freq
keyword: #p
keyword: freq=noraman
keyword: PBEPBE/SDD
title: #p freq=noraman PBEPBE/SDD
converged: YES YES NO NO
title: Mulliken charges:
elementType: O O O O O N N N N N C C C C C C C C C C C H H H H H H H H H H H H H H H
charge: -0.275499 -0.319704 -0.440913 -0.440033 -0.218294 -0.212911 -0.445588 -0.031826 -0.063640 -0.622711 -0.058847 -0.086741 -0.163215 -0.098060 -0.384832 0.354317 -0.230336 -0.146034 -0.506358 0.012318 0.143841 0.256630 0.278423 0.269956 0.246305 0.235045 0.230610 0.349782 0.281569 0.371942 0.257421 0.218498 0.231535 0.354345 0.304239 0.348766
chargesum: 0.00000
title: Mulliken charges with hydrogens summed into heavy atoms:
elementType: O O O O O N N N N N C C C C C C C C C C C
charge: -0.275499 -0.319704 -0.091131 -0.085689 -0.218294 -0.212911 -0.073646 -0.031826 -0.063640 0.030294 0.197782 0.191683 0.106741 0.148245 0.080823 0.354317 0.051233 -0.146034 0.201096 0.012318 0.143841
polarizability: 2.18832868e+02 -2.20155607e+00 1.89274827e+02 -1.25716462e+01 -2.27042128e+00 1.00594456e+02
1716.lowfreq: -7.3700 -1.8667 -0.0005 -0.0003 0.0005 6.9201 21.1820 32.1890 59.1838
frequency: 20.5264 32.1591 59.1706 66.2316 83.9916 96.6197 111.7373 118.7447 164.7045 168.5697 180.5684 205.6656 208.4771 223.9831 230.3207 261.0611 268.5231 288.8463 293.8023 300.2665 321.9604 331.9186 355.2997 399.2251 438.4803 464.0357 475.7340 526.8213 532.0353 553.7488 606.7980 619.9367 645.5325 646.8574 650.8445 692.4317 713.1264 722.6917 759.1679 786.0350 795.0231 828.8481 841.5085 875.7372 907.2139 924.0824 940.3557 961.5219 981.7370 995.8045 1026.0945 1036.0705 1053.7959 1057.1005 1077.8861 1092.7530 1118.9391 1140.2816 1148.1684 1156.7823 1166.1284 1178.9749 1198.6757 1236.2903 1254.6175 1263.7363 1287.3363 1297.2796 1315.9980 1321.8150 1328.1906 1343.4781 1349.3787 1352.5666 1366.4992 1387.7904 1392.0534 1420.9940 1434.9862 1453.7822 1470.8483 1483.3546 1527.8630 1552.6842 1599.6565 1620.1707 1640.3831 2965.3375 2966.7740 2996.8410 3010.5264 3016.4503 3021.4827 3071.1560 3087.8481 3121.6390 3270.4958 3321.6715 3544.7094 3567.5917 3588.6004 3697.9483
redmass: 5.7819 6.6399 5.7518 4.6818 4.7004 3.3416 5.1271 4.1565 2.5980 1.7800 3.7453 3.3958 3.2329 3.1781 1.6761 3.6355 4.3512 2.0485 1.2211 2.1860 7.1189 3.4078 5.0938 5.2993 5.1885 6.6315 4.3704 4.2934 1.2271 5.6960 5.1614 4.5199 4.9924 10.2397 9.5940 9.3675 1.3522 4.5379 2.3572 2.3979 3.7930 3.8449 5.3580 2.6593 3.4117 4.8912 6.4952 5.0769 2.5137 3.6052 4.1779 2.2759 3.9093 2.3379 3.2676 3.1750 1.3454 1.2959 3.3746 2.9616 1.4125 1.3477 2.0496 1.3825 1.5567 2.4212 1.4635 1.2826 1.2722 3.1230 1.3023 2.5376 1.4689 1.3448 1.2478 1.8370 3.2255 4.2025 1.1953 1.0521 1.0809 1.0510 6.0359 2.9524 1.5460 7.6153 3.7033 1.0506 1.0667 1.0850 1.0613 1.0861 1.0878 1.1001 1.1049 1.1025 1.0982 1.0825 1.0450 1.0665 1.0671 1.1045
irintensity: 0.4897 5.0532 0.8221 3.9573 3.5401 12.5401 2.9901 2.5072 6.8862 4.6455 4.5150 53.4821 38.9486 7.1691 56.8637 11.0302 12.0316 42.7505 183.5969 6.9781 5.9249 17.6501 2.6487 1.8463 1.0660 11.0615 10.8997 20.9907 183.9840 14.9796 40.4694 14.9421 8.7760 10.7778 6.5825 30.8560 88.4643 15.7124 28.0370 0.9055 22.6738 7.8539 8.9096 2.4788 1.4290 120.0870 30.0813 81.6858 59.3489 68.2392 25.3101 25.6710 147.3247 32.7732 63.3172 28.4137 9.0031 24.8904 12.0044 10.2321 16.7255 3.8110 94.1312 8.7315 1.3372 2.6272 8.1052 3.8077 2.3502 40.6886 18.8959 94.8194 48.3356 44.3743 1.4209 32.8874 61.0752 53.9880 4.0160 9.4754 9.3630 18.7071 302.1317 124.0070 37.6585 617.8340 304.2976 39.0135 26.7537 19.7674 25.2452 25.8806 36.9338 31.6705 32.9819 17.4235 2.0020 454.5053 75.0401 11.7425 16.4059 40.1824
temp: 298.150 k
press: 1.00000 atm
elementType: 8 8 8 8 8 7 7 7 7 7 6 6 6 6 6 6 6 6 6 6 6 1 1 1 1 1 1 1 1 1 1 1 1 1 1 1
symmnumber: 1
zpe: 718243.6 jmol-1
zpe.correction: 0.273565 hartree
zpe.thermalcorrener: 0.293949 hartree
zpe.thermalcorrenthalpy: 0.294893 hartree
zpe.thermalcorrgfe: 0.223896 hartree
zpe.sumelectzpe: -1076.411939 hartree
zpe.sumelectthermal: -1076.391555 hartree
zpe.sumelectthermalent: -1076.390611 hartree
zpe.sumelectthermalfe: -1076.461608 hartree
dipole: 13.9770 8.2555 -0.8593
dipole: 16.2557
quadrupole: -139.5806 -115.8569 -126.6795
quadrupole: -34.4770 3.0595 3.9636
quadrupole: -12.2082 11.5154 0.6928 -34.4770 3.0595 3.9636
hfenergy: -1076.685504 hartree
pointgroup: C01 [X(C11H15N5O5)]
dipole: 5.6329695 3.0281325 0.0471043 debye
polarizability: 218.8569027|-2.1685793|188.8666184|-11.6806135|7.7530254|100.9786303 unknown
InChI: InChI=1S/C11H15N5O5/c1-20-7-6(18)4(2-17)21-10(7)16-3-13-5-8(16)14-11(12)15-9(5)19/h3-4,6-7,10,14,17-18H,2,12H2,1H3
charge 0 multiplicity 1
36 atoms
O  2.10133 -1.091409 -1.191487
O  1.040248 2.083199 0.236211
O  3.507344 1.729579 -0.958631
O  4.934354 -1.482197 1.262295
O  -4.693701 -1.590993 0.332422
N  -0.172212 -0.760952 -0.593975
N  -1.633723 1.212002 -0.141369
N  -1.756537 -2.403718 -0.410291
N  -3.959472 0.643996 0.24532
N  -3.258553 2.882023 0.266933
C  1.6570 0.765514 0.276731
C  1.091346 -0.074353 -0.901915
C  3.189702 0.705686 0.040476
C  3.373117 -0.734745 -0.493473
C  3.63962 -1.765166 0.624735
C  -1.381476 -0.141054 -0.301483
C  -0.465762 -2.152294 -0.65692
C  -2.354838 -1.145818 -0.182074
C  1.593377 3.028788 1.220317
C  -3.747195 -0.77938 0.150183
C  -2.983725 1.529445 0.120573
H  1.424026 0.265531 1.241376
H  0.955606 0.586505 -1.781311
H  3.780493 0.850814 0.96546
H  4.179237 -0.779477 -1.250137
H  3.589428 -2.78827 0.205939
H  2.885852 -1.68274 1.426011
H  4.474082 1.687671 -1.170068
H  0.303318 -2.878685 -0.896372
H  -0.843209 1.869745 -0.032402
H  2.639357 3.268414 0.962099
H  1.528945 2.616286 2.24721
H  0.976907 3.937556 1.146732
H  5.657058 -1.959097 0.784408
H  -2.626395 3.605643 -0.066219
H  -4.229949 3.11425 0.461596
