program: Gaussian 09
title: 000188953
version: EM64L-G09RevD.01
frameworkgroup: C1[X(C9H13FN3O7P)]
method: RPBEPBE
basis: SDD
operation: Freq
keyword: #p
keyword: freq=noraman
keyword: PBEPBE/SDD
title: #p freq=noraman PBEPBE/SDD
converged: YES YES NO NO
title: Mulliken charges:
elementType: P F O O O O O O O N N N C C C C C C C C C H H H H H H H H H H H H H
charge: 1.399104 -0.200133 -0.421485 -0.430903 -0.489834 -0.260493 -0.669490 -0.733620 -0.587948 -0.222259 -0.030703 -0.615781 -0.129689 -0.002167 -0.492880 0.014463 -0.319219 -0.205069 0.053109 0.137109 0.119104 0.216287 0.275282 0.289463 0.251947 0.295622 0.228987 0.262600 0.358572 0.371281 0.343119 0.346686 0.437684 0.411253
chargesum: 0.00000
title: Mulliken charges with hydrogens summed into heavy atoms:
elementType: P F O O O O O O O N N N C C C C C C C C C
charge: 1.399104 -0.200133 -0.421485 -0.072331 -0.489834 -0.260493 -0.231806 -0.322366 -0.587948 -0.222259 -0.030703 0.074024 0.086598 0.273115 0.048530 0.310085 0.172368 0.166212 0.053109 0.137109 0.119104
polarizability: 1.95528876e+02 -7.85042704e+00 1.87214627e+02 -2.50725784e+00 1.58713896e+01 1.17009388e+02
1716.lowfreq: -9.2486 -7.1140 -0.0006 0.0007 0.0007 10.2418 27.0801 40.2260 55.1858
frequency: 26.5961 40.2088 55.1441 60.8559 84.4347 91.2939 121.5355 143.9900 153.7130 177.9868 189.7367 195.1845 218.3729 231.8188 255.7879 263.6739 270.1468 291.2408 305.7074 315.0607 328.8750 340.6768 356.2762 370.9905 383.0526 411.7581 433.9500 467.4613 473.1520 512.9946 518.2086 523.0139 570.2836 580.1696 598.6822 611.4103 650.3743 664.5994 704.1213 718.5707 737.8217 750.6212 771.5822 778.8109 801.8919 832.2489 892.0860 917.5511 953.8045 971.0340 978.3657 982.8140 1000.1666 1006.0291 1034.3125 1043.0064 1056.5151 1077.5865 1082.6603 1111.5891 1151.0051 1173.5752 1201.2386 1205.3137 1228.4578 1239.2330 1246.8294 1272.3066 1275.8959 1286.9642 1316.5463 1319.9221 1334.7632 1372.5596 1381.8940 1402.1690 1444.1619 1471.2578 1495.7332 1512.9231 1583.6149 1627.3943 1654.3178 2964.1278 3014.7484 3039.3765 3047.4251 3061.3737 3075.0244 3093.7160 3123.5934 3124.9806 3539.0757 3580.5223 3609.2026 3693.4483
redmass: 6.5049 10.2480 8.7703 7.0632 7.2607 7.1563 5.5350 5.7168 9.5944 3.0803 7.0831 6.6133 5.3814 2.0686 6.2683 5.9767 4.6686 1.1263 6.9025 2.8455 5.8094 7.5443 5.2180 6.0251 4.4587 3.6216 4.8486 3.4969 9.7268 3.0904 1.1763 3.8908 5.4648 1.2308 8.9058 4.7490 6.2423 8.7447 9.1111 7.5398 9.3530 7.9718 2.0090 2.0566 3.7464 3.9807 2.2503 3.1170 5.8154 1.5080 2.6807 1.3658 2.7901 2.3958 3.4786 3.1427 3.3544 2.7372 3.6811 2.2809 2.1898 1.7217 1.7384 2.0038 1.3383 1.2898 1.3581 1.5829 1.4361 1.3844 1.5865 1.3010 1.3016 1.2968 1.7011 1.5771 1.0855 1.0894 6.7659 4.0393 2.5479 2.4030 6.3126 1.0846 1.0607 1.0649 1.0832 1.0695 1.0886 1.1052 1.1021 1.0970 1.0448 1.0667 1.0664 1.1054
irintensity: 1.8949 2.5200 1.0156 0.0912 6.7812 8.1757 2.7583 4.9279 1.1310 35.9416 5.7251 4.0320 5.4006 46.8517 7.0104 5.8543 3.1447 144.6782 12.8039 23.2139 10.7952 35.8120 21.0994 8.8879 1.2388 4.9186 2.9137 14.8767 4.4976 11.2777 138.9820 13.9447 1.9542 139.2877 25.8515 4.0465 15.9118 131.1269 8.6305 24.0951 16.8188 28.7887 68.3298 176.9364 78.0589 8.2486 40.9260 107.8331 136.6161 57.3433 178.3970 55.2022 21.1401 41.7134 43.5564 6.9899 75.9259 5.3117 148.0027 17.2635 29.2405 48.9656 11.3004 26.3075 28.1888 20.2567 195.2340 210.1095 30.1024 6.7695 61.5879 8.0332 8.3417 2.9881 25.1130 7.6638 14.1079 14.4703 112.1107 283.1832 320.5564 135.7062 490.7317 31.9313 16.4029 2.5841 63.0571 695.3967 13.6252 8.2463 3.3116 180.7681 149.6621 18.6793 72.1960 55.9361
temp: 298.150 k
press: 1.00000 atm
elementType: 15 9 8 8 8 8 8 8 8 7 7 7 6 6 6 6 6 6 6 6 6 1 1 1 1 1 1 1 1 1 1 1 1 1
symmnumber: 1
zpe: 631965.0 jmol-1
zpe.correction: 0.240703 hartree
zpe.thermalcorrener: 0.261733 hartree
zpe.thermalcorrenthalpy: 0.262678 hartree
zpe.thermalcorrgfe: 0.190919 hartree
zpe.sumelectzpe: -1481.027900 hartree
zpe.sumelectthermal: -1481.006869 hartree
zpe.sumelectthermalent: -1481.005925 hartree
zpe.sumelectthermalfe: -1481.077683 hartree
dipole: 4.6454 0.9126 -5.5349
dipole: 7.2834
quadrupole: -161.1353 -118.4119 -129.7097
quadrupole: -28.3122 -5.2280 -1.2528
quadrupole: -24.7163 18.0071 6.7092 -28.3122 -5.2280 -1.2528
hfenergy: -1481.2686025 hartree
pointgroup: C01 [X(C9H13F1N3O7P1)]
dipole: 1.5350595 0.2231246 -2.4093425 debye
polarizability: 191.9620284|-5.9143391|187.9708202|-11.4175258|19.2576884|119.8200427 unknown
InChI: InChI=1S/C9H13FN3O7P/c10-4-2-13(9(15)12-8(4)11)7-1-5(14)6(20-7)3-19-21(16,17)18/h2,5-7,14,16-17H,1,3,11H2
charge 0 multiplicity 1
34 atoms
P  -3.539081 -1.217347 0.703468
F  1.035711 -3.102381 -1.532915
O  -0.994424 0.826672 0.804225
O  -1.341297 3.825725 -1.189474
O  -3.832924 0.27315 -0.147452
O  3.105397 1.363335 0.892861
O  -2.628149 -0.793393 2.065701
O  -2.344907 -1.945754 -0.35311
O  -4.82728 -2.080903 0.972618
N  1.242534 0.148402 0.165965
N  3.500717 -0.659117 -0.252174
N  3.814114 -2.696177 -1.367527
C  -0.751169 2.523401 -0.888534
C  -1.803274 1.741689 -0.074765
C  0.470706 2.570868 0.059197
C  0.422489 1.225224 0.811962
C  -2.769542 0.929853 -0.935319
C  0.694307 -0.980289 -0.413466
C  2.693767 0.325109 0.29545
C  1.544685 -1.926639 -0.932387
C  2.973422 -1.748241 -0.848156
H  -0.498474 1.980394 -1.824908
H  -2.35381 2.440989 0.580405
H  1.436528 2.716933 -0.445195
H  0.325825 3.393415 0.781964
H  0.771105 1.316088 1.853031
H  -2.230092 0.179994 -1.543351
H  -3.313463 1.627572 -1.594652
H  -0.734276 4.341293 -1.777065
H  -0.392777 -1.120572 -0.414469
H  3.448131 -3.536088 -1.810207
H  4.818166 -2.550881 -1.275421
H  -1.87256 -0.147359 1.835233
H  -2.540207 -2.884062 -0.601132
