program: Gaussian 09
title: 000188945
version: EM64L-G09RevD.01
frameworkgroup: C1[X(C22H27ClFN3)]
method: RPBEPBE
basis: SDD
operation: Freq
keyword: #p
keyword: freq=noraman
keyword: PBEPBE/SDD
title: #p freq=noraman PBEPBE/SDD
converged: YES YES NO NO
title: Mulliken charges:
elementType: Cl F N N N C C C C C C C C C C C C C C C C C C C C C C H H H H H H H H H H H H H H H H H H H H H H H H H H H
charge: -0.062497 -0.215731 -0.183504 -0.473293 -0.049833 -0.043256 -0.433805 -0.425497 -0.345641 -0.710416 0.280880 -0.302545 -0.315205 0.255059 0.260783 -0.093028 -0.115140 -0.718042 -0.716463 -0.288810 -0.511259 -0.301294 -0.284394 -0.297503 0.298028 -0.110910 -0.390541 0.195984 0.204033 0.208678 0.207687 0.213715 0.197022 0.221871 0.383350 0.221131 0.214498 0.257628 0.192194 0.218629 0.195547 0.245688 0.220015 0.257040 0.222149 0.238302 0.219555 0.212090 0.224795 0.254020 0.289278 0.269022 0.253375 0.256562
chargesum: 0.00000
title: Mulliken charges with hydrogens summed into heavy atoms:
elementType: Cl F N N N C C C C C C C C C C C C C C C C C C C C C C
charge: -0.062497 -0.215731 -0.183504 -0.089942 -0.049833 0.152728 -0.021094 -0.004094 0.073252 -0.017159 0.280880 0.108278 0.126030 0.255059 0.260783 -0.093028 -0.115140 -0.018838 -0.046517 -0.064016 -0.257239 -0.012016 -0.015372 -0.044128 0.298028 -0.110910 -0.133979
polarizability: 4.02395569e+02 3.00480905e+01 3.23855797e+02 -2.18106120e+01 3.98828716e+00 1.69806389e+02
1716.lowfreq: -14.0551 -2.8198 -0.0018 -0.0015 0.0005 6.1433 15.5529 28.8193 44.2532
frequency: 10.0795 28.6226 44.2325 51.7092 54.3950 71.1153 78.5698 88.6435 113.7763 122.9433 130.9297 135.4393 142.3374 161.1712 195.4195 198.3404 211.3815 228.6783 238.5150 245.3175 250.6479 253.2021 274.8324 289.3037 313.4641 323.6591 337.3289 368.3363 382.6971 391.6632 400.4303 418.3436 435.0323 438.9792 470.9976 475.4013 480.3908 490.9710 503.3341 527.7691 552.4876 595.5990 605.3120 634.3445 652.6441 671.0838 691.0206 702.5352 726.0956 763.0892 766.8845 776.6923 797.1879 805.6912 816.3235 829.1379 837.0903 856.0830 866.2007 877.3809 891.3715 893.0496 901.9962 909.2824 929.8015 943.2644 946.5039 965.8610 978.3298 1005.3717 1024.6689 1056.9563 1061.6733 1069.7038 1080.9756 1089.7497 1092.4410 1095.7285 1109.1824 1117.0911 1136.4961 1139.7419 1144.9238 1170.5171 1180.1451 1190.1628 1212.4025 1220.1680 1238.1576 1244.1123 1259.2697 1273.8799 1282.1891 1286.0721 1292.9761 1296.0973 1310.2740 1336.4089 1340.2361 1346.0131 1364.4483 1369.2501 1369.9379 1376.8401 1389.6581 1391.5499 1399.0716 1403.0989 1411.5916 1441.8272 1450.5109 1454.4275 1462.0183 1465.6980 1467.9946 1470.7548 1472.9268 1475.1742 1478.6873 1482.9431 1484.0397 1488.5314 1495.4179 1510.7151 1526.4470 1555.3542 1595.4858 1619.1647 1628.1622 2879.1331 2881.2033 2888.4909 2926.0875 2977.6159 2986.6725 2987.2554 2990.5141 2996.5280 3017.2155 3029.5449 3034.0659 3043.9894 3055.3378 3063.0408 3082.2241 3084.5182 3086.3474 3090.9943 3098.5966 3103.7299 3160.3532 3165.5797 3180.8091 3181.7026 3188.9021 3195.4755
redmass: 3.9665 4.5738 4.4783 5.9604 2.0244 4.6765 4.5921 2.6603 4.0789 3.1526 1.7774 4.0775 4.0202 4.1112 3.0460 1.5053 1.2597 1.5977 3.7290 3.3144 6.3103 1.9340 6.1962 5.4402 2.4800 2.6710 3.3673 5.9347 3.9088 4.5950 3.1418 4.0213 2.6008 3.6317 3.3724 5.3967 2.7521 3.0293 2.4851 5.1779 3.7009 6.1991 4.6953 7.3831 6.0247 6.4581 2.5154 6.1313 3.3196 4.6362 1.8549 2.4058 1.2652 1.9423 1.2453 2.0089 2.9607 1.5625 1.6116 1.4476 1.5337 1.8578 5.1813 2.0518 1.9168 1.5367 1.7924 1.3298 3.7782 1.6876 2.1194 2.5051 2.1345 1.8314 2.8889 1.8791 2.4487 2.2869 1.6401 2.1818 2.0793 1.7447 1.7471 2.3222 2.2916 2.6639 1.6279 1.4450 1.6439 1.8115 1.5821 1.3537 2.1567 1.1784 1.1965 1.1825 2.3763 1.3000 1.4148 1.4731 1.2879 2.3369 1.7994 1.3620 1.3491 3.8402 1.2225 1.2273 3.8168 4.0021 3.3528 1.0836 1.0837 1.1030 1.0662 1.0638 1.2367 1.1649 1.7738 1.0518 1.1529 1.0604 1.0752 5.3760 7.7710 8.1248 3.5249 1.6072 6.5248 1.0717 1.0720 1.0711 1.0819 1.0615 1.0521 1.0470 1.0369 1.0370 1.0865 1.0954 1.0920 1.0982 1.0887 1.0899 1.1000 1.0989 1.0985 1.0976 1.0986 1.0999 1.0878 1.0889 1.0931 1.0981 1.0905 1.0937
irintensity: 0.0558 0.0407 0.1579 0.1511 0.1745 0.8887 0.6460 0.4226 1.2949 0.2609 0.6769 0.2850 0.5967 0.8064 0.2033 3.2884 0.1836 0.3613 0.4626 0.3503 1.7028 1.7512 3.7568 0.6896 1.0315 8.8271 6.5086 2.3645 2.7424 7.1272 3.6716 6.7777 2.6719 12.2885 1.7080 8.4736 3.3366 2.3918 2.9295 3.4994 24.0270 4.8441 0.7232 3.0091 4.8281 6.1158 26.4215 7.0761 0.9034 31.3785 6.1908 9.4333 5.1101 34.8844 6.3428 27.1750 27.5792 4.7133 32.6473 20.9850 26.0174 60.8394 90.5642 10.9459 5.6388 4.7731 2.7612 0.4893 13.0933 20.8792 14.8063 16.6624 24.5452 5.8791 15.6613 21.3394 3.9840 19.1908 12.3889 6.6244 19.3334 64.8930 10.4270 5.7437 18.0234 40.3777 5.7032 5.3934 15.6134 3.6715 2.5183 6.0132 3.9783 13.6566 8.3815 16.7156 5.9561 44.4116 1.0716 4.2472 4.7052 34.2203 19.6990 3.6191 29.4258 29.7135 15.9596 13.8711 25.7075 140.5735 128.8685 10.8735 5.5153 16.1847 27.3245 3.4480 43.6885 18.3763 27.9455 12.2861 14.8908 8.1920 12.2836 101.9247 66.9095 89.0839 102.0779 68.7674 87.5454 58.2882 64.6211 417.7137 46.4018 19.6416 61.7610 30.8946 27.7732 22.6925 849.0335 10.8815 47.9699 51.7420 9.2379 31.4307 36.5238 58.9704 36.4232 34.4324 24.5371 25.0800 0.3788 0.2008 0.8755 6.4539 6.4407 11.0756
temp: 298.150 k
press: 1.00000 atm
elementType: 17 9 7 7 7 6 6 6 6 6 6 6 6 6 6 6 6 6 6 6 6 6 6 6 6 6 6 1 1 1 1 1 1 1 1 1 1 1 1 1 1 1 1 1 1 1 1 1 1 1 1 1 1 1
symmnumber: 1
zpe: 1167209.5 jmol-1
zpe.correction: 0.444567 hartree
zpe.thermalcorrener: 0.471051 hartree
zpe.thermalcorrenthalpy: 0.471995 hartree
zpe.thermalcorrgfe: 0.387030 hartree
zpe.sumelectzpe: -1576.702033 hartree
zpe.sumelectthermal: -1576.675549 hartree
zpe.sumelectthermalent: -1576.674604 hartree
zpe.sumelectthermalfe: -1576.759570 hartree
dipole: 5.9624 -4.7525 0.4760
dipole: 7.6395
quadrupole: -182.0904 -158.0965 -168.5334
quadrupole: -5.3007 4.8740 3.1956
quadrupole: -12.5170 11.4769 1.0400 -5.3007 4.8740 3.1956
hfenergy: -1577.1465996 hartree
pointgroup: C01 [X(C22H27Cl1F1N3)]
dipole: -2.9488611 0.5748492 -0.0869645 debye
polarizability: 357.032898|51.9526451|365.208084|30.2228453|-8.4045856|173.8167732 unknown
InChI: InChI=1S/C22H27ClFN3/c1-4-27(5-2)12-6-7-15(3)25-22-18-10-8-16(23)13-21(18)26-20-11-9-17(24)14-19(20)22/h8-11,13-15,25H,4-7,12H2,1-3H3
charge 0 multiplicity 1
54 atoms
Cl 5.069879 3.638809 0.555138
F  -1.546529 -4.470055 -0.548803
N  -3.655785 -0.422108 0.632176
N  -1.194594 0.638114 -0.607055
N  2.720135 -0.954177 0.300252
C  -1.612121 1.801119 -1.433271
C  -3.136149 1.705635 -1.705284
C  -4.058002 1.85496 -0.461108
C  -4.660468 0.527791 0.053464
C  -0.832003 1.858836 -2.767752
C  0.092037 0.183482 -0.340509
C  -3.283848 0.038334 2.017072
C  -4.172458 -1.834087 0.664918
C  1.248524 1.028918 -0.135281
C  0.298933 -1.248531 -0.21919
C  2.535421 0.394385 0.154709
C  1.618554 -1.753029 0.130472
C  -2.196613 -0.797199 2.71565
C  -4.580938 -2.402219 -0.707389
C  1.206341 2.466883 -0.129669
C  -0.74875 -2.19676 -0.466912
C  3.704055 1.2176 0.346737
C  1.806946 -3.172558 0.290789
C  2.340943 3.24679 0.083809
C  -0.497989 -3.548483 -0.301479
C  3.592231 2.5953 0.304268
C  0.765775 -4.073814 0.088913
H  -1.459474 2.756542 -0.885846
H  -3.371412 2.508623 -2.429017
H  -3.347344 0.747098 -2.222142
H  -4.914102 2.508324 -0.720123
H  -3.515277 2.379942 0.349223
H  -5.45676 0.747273 0.806134
H  -5.154102 0.032664 -0.800086
H  -1.999573 0.044047 -0.284582
H  -1.04949 0.960153 -3.373251
H  -1.13139 2.752145 -3.345819
H  0.25769 1.907841 -2.608038
H  -4.199697 0.065705 2.658013
H  -2.923285 1.079023 1.928347
H  -5.036626 -1.911682 1.370018
H  -3.365135 -2.463875 1.074696
H  -1.900683 -0.293147 3.653538
H  -1.296226 -0.895696 2.086909
H  -2.54471 -1.809669 2.983107
H  -4.687712 -3.498446 -0.629043
H  -3.809395 -2.200547 -1.472183
H  -5.542399 -2.000985 -1.072759
H  0.258937 2.985307 -0.280136
H  -1.737395 -1.873478 -0.797005
H  4.650187 0.706332 0.539069
H  2.809262 -3.507412 0.572335
H  2.281513 4.33846 0.087838
H  0.896772 -5.153677 0.202839
