program: Gaussian 09
title: 000196821
version: EM64L-G09RevD.01
frameworkgroup: C1[X(C10H8O5)]
method: RPBEPBE
basis: SDD
operation: Freq
keyword: #pfreq=noraman
keyword: PBEPBE/SDD
title: #p freq=noraman PBEPBE/SDD
converged: NO NO NO NO
title: Mulliken charges:
elementType: O O O O O C C C C C C C C C C H H H H H H H H
charge: -0.233521 -0.313974 -0.423874 -0.411399 -0.247853 0.472504 0.163782 -0.512334 -0.462965 0.234986 0.130073 -0.379975 0.135224 0.070095 -0.521507 0.265565 0.278713 0.272657 0.383554 0.234091 0.234106 0.248985 0.383066
chargesum: 0.00000
title: Mulliken charges with hydrogens summed into heavy atoms:
elementType: O O O O O C C C C C C C C C C
charge: -0.233521 -0.313974 -0.040320 -0.028333 -0.247853 0.472504 0.163782 -0.246768 -0.184252 0.234986 0.130073 -0.107318 0.135224 0.070095 0.195674
polarizability: 2.39475884e+02 7.03386891e+00 1.30381314e+02 1.20921382e-03 -2.72953788e-03 5.39007698e+01
1716.lowfreq: -10.1860 -2.3987 -0.0006 0.0005 0.0008 4.9027 65.5796 89.6875 114.1600
frequency: 65.5652 89.6588 114.1482 156.6029 174.0487 207.4171 237.8699 256.8941 289.3821 313.8589 326.4504 366.5817 403.7860 418.9185 421.5301 452.9327 481.2226 511.6919 534.2694 534.4377 582.2458 645.6882 664.9802 701.0290 708.7504 724.6430 753.2204 793.5369 840.2138 854.5908 882.7218 899.6737 979.4426 1042.0986 1104.7256 1117.7329 1155.9195 1156.8276 1177.6988 1182.0764 1201.2461 1236.6289 1266.1744 1300.9831 1385.7984 1409.4030 1441.1824 1466.6471 1471.2236 1481.4724 1508.1854 1564.2405 1614.7724 1644.0040 1656.2143 2973.5902 3066.8850 3137.7894 3165.9408 3168.4240 3181.1584 3455.4801 3518.7641
redmass: 4.8575 8.6368 4.6980 3.9422 4.2544 1.6251 5.5073 2.8345 6.0539 5.9251 5.7017 10.0692 4.6890 7.4292 6.4729 2.9914 1.1181 6.8403 1.1050 6.3390 7.3297 5.7550 8.3330 7.7589 5.4596 3.5348 5.8875 7.2060 1.5553 1.3997 3.7411 1.5051 6.0533 9.9725 4.4298 1.2544 1.6935 1.4296 1.8667 2.2706 1.6375 1.6391 2.4188 3.0852 3.2261 3.8657 1.2367 1.0487 1.2581 2.8019 3.9901 8.7323 10.4072 7.4028 7.1956 1.0323 1.1049 1.1008 1.0931 1.0926 1.0921 1.0643 1.0647
irintensity: 4.6418 0.6196 2.2429 2.3618 0.4547 0.0502 4.5781 0.1229 22.1312 3.7413 1.2764 0.6379 0.0309 0.7600 6.8095 32.2128 128.6032 9.0706 147.0015 31.2562 14.6265 4.0960 4.7948 13.0509 9.6777 6.3802 39.4786 4.0510 28.0043 8.3966 30.6100 51.4599 48.9871 104.4719 148.4720 0.0850 10.9360 59.7738 51.0101 223.2491 74.0155 66.9319 258.7622 278.9068 18.5567 41.2569 30.8832 16.3175 64.2672 4.6690 213.6634 135.2063 427.8606 67.3546 45.1471 53.9465 36.2733 17.7254 5.3942 2.5111 1.3855 112.2983 101.1655
temp: 298.150 k
press: 1.00000 atm
elementType: 8 8 8 8 8 6 6 6 6 6 6 6 6 6 6 1 1 1 1 1 1 1 1
symmnumber: 1
zpe: 428510.1 jmol-1
zpe.correction: 0.163211 hartree
zpe.thermalcorrener: 0.176122 hartree
zpe.thermalcorrenthalpy: 0.177067 hartree
zpe.thermalcorrgfe: 0.124345 hartree
zpe.sumelectzpe: -760.891097 hartree
zpe.sumelectthermal: -760.878186 hartree
zpe.sumelectthermalent: -760.877241 hartree
zpe.sumelectthermalfe: -760.929963 hartree
dipole: 4.7676 -0.8920 -0.0034
dipole: 4.8504
quadrupole: -79.9659 -88.2402 -87.8425
quadrupole: -17.1306 -0.0279 -0.0096
quadrupole: 5.3836 -2.8907 -2.4929 -17.1306 -0.0279 -0.0096
hfenergy: -761.0543078 hartree
pointgroup: C01 [X(C10H8O5)]
dipole: -1.879585 0.3155678 -0.0953531 debye
dipolederiv: -0.9943906 -0.2614642 0.0346607 0.0643034 -0.3294498 0.0307143 -0.0271123 0.0247728 -0.1789449 -1.6992756 0.56237 -0.1319034 0.7206765 -0.7280989 0.0950051 -0.162177 0.0922164 -0.3162205 -1.2003969 -0.5521093 0.0898686 -0.7168311 -0.519929 0.0073457 0.1208622 0.0103482 -0.4076282 -1.6549993 0.1049779 -0.0427228 0.4182722 -0.1981039 -0.031721 -0.1020129 -0.0374524 -0.4012362 -1.3215717 -0.4156874 0.0613919 -0.8255549 -0.8425972 0.0773 0.1386113 0.0844759 -0.370081 -0.1026567 0.0339994 -0.0081407 0.1595119 -0.0575443 0.0146432 -0.0320725 0.0123311 0.0012217 0.4095791 0.1405438 -0.021058 0.0650208 0.1998668 -0.021612 -0.0067225 -0.0203532 0.0839139 -0.0030352 -0.1760573 0.0361087 0.1023376 0.0724186 -0.0449346 -0.0167063 -0.0502981 -0.1662343 -0.2651313 0.0371921 -0.0086495 -0.1068401 -0.0509397 -0.0259455 0.0185575 -0.0231139 -0.1728322 1.3028269 -0.479651 0.1135454 -0.8123569 0.0960116 -0.0244035 0.1769153 -0.0185326 0.0519611 0.8096593 0.5818461 -0.0958373 1.1697939 0.3465245 -0.030808 -0.206312 -0.0411583 0.0718013 0.223302 0.1442055 -0.0213311 -0.2375967 0.1693212 -0.0588806 0.0511314 -0.051755 -0.1075782 1.2766944 -0.1564488 0.0523246 -0.988051 -0.3435173 0.0559793 0.2100771 0.0710568 0.0368264 1.5481231 0.4843567 -0.0687522 1.2719636 1.0634494 -0.1264927 -0.2176475 -0.1404828 0.2979745 0.4046206 -0.1449808 0.0289634 -0.6243259 0.6621295 -0.0762379 0.1197791 -0.0676756 0.3343976 0.0849123 0.0404958 -0.009207 -0.0007845 -0.0187155 0.0356563 -0.0014531 0.036338 0.1633172 0.102149 0.016312 -0.0045327 0.0439681 -0.002843 0.0362279 -0.0097193 0.0357633 0.1775883 0.0859536 -0.0030778 -0.0008192 0.0608153 -0.0154747 0.0349009 -0.012933 0.0337208 0.1562264 0.4075591 0.1408903 -0.0264085 0.1218109 0.2951848 0.0193138 -0.023211 0.0196078 0.3792969 0.0844285 -0.0528184 0.115124 0.107029 -0.0172028 0.0453214 0.0188457 0.0767011 -0.0937257 0.0895058 -0.0868464 -0.0825865 0.0957852 -0.0691798 -0.0524571 -0.0512998 -0.0900424 -0.0469415 -0.1410745 0.0551812 -0.0155912 0.015374 0.0770716 0.0100031 -0.0080947 0.010787 0.1264552 0.553218 -0.0132295 0.0055526 -0.1043216 0.2116181 0.0310819 0.0226943 0.0327454 0.380442 unknown
polarizability: 239.2265117|8.8459892|127.9768381|1.7021981|-13.8584261|56.554618 unknown
InChI: InChI=1S/C10H8O5/c1-14-9-4-8-5(2-6(9)11)3-7(12)10(13)15-8/h2-4,11-12H,1H3
charge 0 multiplicity 1
23 atoms
O  1.196477 1.321384 -0.371099
O  -3.615078 0.416888 -0.286228
O  -3.155765 -2.166803 0.209342
O  4.108033 -0.91124 0.105792
O  3.474666 1.735539 -0.407972
C  0.370945 -0.968196 0.048357
C  0.130594 0.412339 -0.217467
C  -0.756759 -1.829066 0.190607
C  -1.16807 0.945777 -0.34154
C  -2.257671 0.072595 -0.196042
C  -2.052572 -1.322085 0.07097
C  1.737614 -1.423446 0.159411
C  2.774918 -0.52804 0.008597
C  2.547023 0.898485 -0.266423
C  -3.949692 1.819389 -0.558578
H  -0.621542 -2.895256 0.394303
H  -1.285515 2.012624 -0.545514
H  1.95679 -2.475813 0.362797
H  -3.984619 -1.630991 0.090715
H  -3.534669 2.137305 -1.5335
H  -3.568931 2.475359 0.246794
H  -5.047747 1.857162 -0.586816
H  4.67437 -0.101712 -0.036907
