program: Gaussian 09
title: 000196888
version: EM64L-G09RevD.01
frameworkgroup: C1[X(C20H20O8)]
method: RPBEPBE
basis: SDD
operation: Freq
keyword: #pfreq=noraman
keyword: PBEPBE/SDD
title: #p freq=noraman PBEPBE/SDD
converged: YES YES NO NO
title: Mulliken charges:
elementType: O O O O O O O O C C C C C C C C C C C C C C C C C C C C H H H H H H H H H H H H H H H H H H H H
charge: -0.179236 -0.412918 -0.447061 -0.230236 -0.454144 -0.127253 -0.375400 -0.419084 -0.188208 -0.265445 0.324475 -0.222297 -0.277249 0.186646 -0.404126 0.326609 -0.742785 -0.774864 0.001077 -0.171856 -0.457197 -0.122672 0.367140 0.152767 -0.621113 0.227459 0.360264 -0.577851 0.209744 0.270586 0.278213 0.276739 0.292510 0.241640 0.250397 0.220209 0.238254 0.277582 0.207694 0.353123 0.223466 0.194978 0.343486 0.293493 0.361669 0.254522 0.365677 0.370577
chargesum: 0.00000
title: Mulliken charges with hydrogens summed into heavy atoms:
elementType: O O O O O O O O C C C C C C C C C C C C C C C C C C C C
charge: -0.179236 -0.059795 -0.103575 -0.230236 -0.092474 -0.127253 -0.009723 -0.048507 0.021536 0.005140 0.324475 0.055916 -0.000510 0.186646 -0.111616 0.326609 -0.030540 -0.051334 0.001077 -0.171856 -0.038754 -0.122672 0.367140 0.152767 -0.327619 0.227459 0.360264 -0.323329
polarizability: 3.34148303e+02 -2.10653180e+01 2.78487685e+02 -1.34966227e+01 -2.02727810e+01 1.61000939e+02
1716.lowfreq: -8.4711 -2.5610 0.0006 0.0007 0.0010 5.9051 24.8115 31.0774 48.0612
frequency: 24.6347 31.0715 48.0322 58.6352 71.0859 80.8019 89.3211 106.0157 137.9260 154.3697 157.9727 171.1421 197.4384 206.3483 212.0499 217.5100 235.9462 244.7797 251.9680 258.2651 262.2023 274.5258 292.6947 307.7300 315.3956 335.0933 340.8586 351.0725 375.5536 384.3286 399.6321 405.0350 423.0433 430.7107 438.8885 454.7152 464.2010 483.9489 506.2434 518.8470 526.2695 546.2751 564.7736 578.0768 592.8568 611.5185 619.6805 624.1212 661.1160 665.0845 700.7896 729.7319 747.4889 761.8181 789.4863 796.3353 836.6580 845.2022 863.6447 889.5597 890.5983 896.2198 921.0103 927.0286 930.9817 932.7464 957.0878 960.9878 987.0651 991.7071 998.8168 1020.7411 1029.1150 1047.4106 1088.8883 1112.0408 1124.2978 1142.2102 1150.9012 1165.4760 1175.0962 1179.2558 1187.0430 1200.0655 1208.7447 1217.4318 1233.0253 1241.0401 1247.3073 1252.0175 1273.0242 1281.9571 1305.5403 1308.1482 1314.3107 1323.6286 1330.6208 1344.7257 1365.5860 1371.5894 1379.7701 1382.5161 1394.2657 1398.7752 1426.9778 1443.5087 1452.0013 1469.6355 1470.1849 1473.4424 1475.7222 1496.7000 1522.0175 1555.0265 1569.2385 1600.5541 1626.3189 1672.1108 2933.4047 2939.1119 2970.4597 2992.1290 3000.3131 3045.5614 3074.3368 3081.5034 3088.5678 3095.8461 3102.7886 3116.3179 3136.8443 3147.4467 3148.6062 3445.7813 3528.4242 3530.5540 3540.0301 3580.3921
redmass: 6.6987 7.2366 6.4267 7.7400 6.5497 5.7356 4.7250 4.6223 4.6452 8.0348 5.2362 3.0015 1.2552 3.6606 4.6197 3.6718 3.4015 2.0586 1.9949 1.9377 3.2947 3.2828 3.2607 4.6869 4.4571 3.1060 1.1615 6.2737 5.3127 4.8782 4.5306 1.1284 3.5862 1.7919 2.2477 7.7998 3.7582 5.0433 5.6081 4.9462 4.7807 6.6856 5.2569 1.1776 5.9715 5.1300 4.0820 4.4817 5.8901 4.6789 4.3353 6.3216 5.7588 4.6194 5.0413 4.2391 3.8541 1.9017 2.9140 3.3464 3.3458 1.8995 2.1341 3.7956 2.3025 1.6449 4.0938 2.6828 2.1585 4.3126 1.4368 3.5769 2.8949 2.5215 2.3787 2.0070 2.0064 1.8245 1.3535 1.8208 1.1667 1.3779 1.3730 1.6324 2.5606 2.3587 1.7148 2.1096 1.5526 1.8806 2.0827 4.4276 1.2505 1.7660 1.9814 2.1657 1.6901 1.1501 7.2699 1.2749 1.2758 1.5221 1.2047 1.2188 7.2542 3.6645 1.0522 1.0610 1.1006 1.0550 4.1451 1.0526 9.6043 10.6684 9.7578 7.8409 6.6920 7.8460 1.0696 1.0814 1.0818 1.0362 1.0370 1.0851 1.0936 1.0866 1.0990 1.0995 1.0996 1.1001 1.0919 1.0925 1.0912 1.0667 1.0659 1.0660 1.0658 1.0662
irintensity: 3.3966 0.0498 0.5364 3.9923 3.9318 2.7665 3.8159 1.0373 2.0039 2.0499 6.5406 1.0066 0.6869 14.2223 1.5714 8.5163 26.6069 90.8049 47.3216 31.9444 2.1252 1.3244 14.3210 4.7675 14.5740 14.8934 150.1386 3.6670 7.6616 50.0929 5.9384 88.5274 19.5448 84.4186 100.6940 1.6919 1.2846 0.6532 5.6832 7.9459 3.8493 15.8551 20.9704 67.5780 0.9578 7.8870 1.7331 16.0073 9.0814 4.1341 1.9087 21.2762 11.5627 16.2390 8.1388 7.2408 18.9103 16.5180 21.8032 91.0446 0.6827 59.3384 38.9686 21.9256 35.5519 9.8170 119.5222 22.9537 8.7695 50.9454 1.6090 44.3727 69.1554 27.6928 28.4146 226.3177 62.9116 177.3385 134.1769 4.5092 19.4318 69.6870 43.9721 63.3188 27.6758 17.5141 82.9529 94.7633 1.4199 17.7304 90.5966 109.6409 24.7152 11.4951 27.1178 48.9799 5.8741 43.2497 234.2438 8.0643 31.6129 0.6179 92.6084 28.7189 4.5909 28.4839 3.9774 5.8049 10.6468 3.7574 8.6618 13.7333 135.3921 314.4652 201.6940 144.6369 112.3699 5.7339 61.7231 3.8573 28.1466 13.0925 19.2666 14.8273 21.1135 17.4321 21.3827 14.0384 20.6929 13.2490 8.1513 4.1636 11.7856 39.2364 7.7023 7.5114 41.2987 78.1667
temp: 298.150 k
press: 1.00000 atm
elementType: 8 8 8 8 8 8 8 8 6 6 6 6 6 6 6 6 6 6 6 6 6 6 6 6 6 6 6 6 1 1 1 1 1 1 1 1 1 1 1 1 1 1 1 1 1 1 1 1
symmnumber: 1
zpe: 960680.2 jmol-1
zpe.correction: 0.365904 hartree
zpe.thermalcorrener: 0.391983 hartree
zpe.thermalcorrenthalpy: 0.392927 hartree
zpe.thermalcorrgfe: 0.311097 hartree
zpe.sumelectzpe: -1373.818685 hartree
zpe.sumelectthermal: -1373.792606 hartree
zpe.sumelectthermalent: -1373.791662 hartree
zpe.sumelectthermalfe: -1373.873492 hartree
dipole: 2.9836 -0.2649 2.5214
dipole: 3.9153
quadrupole: -153.2611 -173.2728 -162.8294
quadrupole: -27.1383 -9.4405 10.5341
quadrupole: 9.8600 -10.1517 0.2917 -27.1383 -9.4405 10.5341
hfenergy: -1374.1845889 hartree
pointgroup: C01 [X(C20H20O8)]
dipole: 1.152166 -0.0469218 -1.0213502 debye
polarizability: 337.1801174|17.1858586|272.2636703|6.365093|-29.6353224|164.1931397 unknown
InChI: InChI=1S/C20H20O8/c1-20(2)14-9(3-7(6-21)15(24)18(14)27)13-16(25)10-4-8(22)5-11(23)12(10)17(26)19(13)28-20/h3-5,9,14-15,18,21-24,27H,6H2,1-2H3
charge 0 multiplicity 1
48 atoms
O  -0.54138 -2.381681 0.115709
O  -1.970123 -0.516598 2.040445
O  -5.132888 0.737199 0.449404
O  0.732006 1.910223 -1.630926
O  -4.801593 3.596293 0.158386
O  1.947154 -2.804425 0.902157
O  4.478049 -1.921484 1.291173
O  5.673702 2.38017 -0.513412
C  -2.505867 -0.878689 -0.406813
C  -1.525308 0.2011 -0.965182
C  -1.916302 -2.314599 -0.532281
C  -3.019984 -0.517038 1.010475
C  -3.745306 0.845735 1.01016
C  -0.065418 -0.100794 -0.592358
C  -1.956843 1.616429 -0.576554
C  -2.963282 1.926131 0.287019
C  -1.71083 -2.717703 -2.008897
C  -2.705232 -3.382744 0.235387
C  0.307337 -1.327898 -0.060336
C  0.983752 0.862874 -0.936626
C  -3.401841 3.354084 0.561641
C  1.722825 -1.667396 0.396709
C  2.393872 0.598173 -0.474727
C  2.744716 -0.613328 0.1979
C  3.341273 1.606159 -0.728462
C  4.105775 -0.761058 0.62449
C  4.676556 1.426748 -0.30023
C  5.059017 0.253567 0.376893
H  -3.405349 -0.873248 -1.058876
H  -1.575655 0.185051 -2.075523
H  -3.737719 -1.275026 1.360824
H  -3.930801 1.121776 2.063492
H  -1.402258 2.414185 -1.082426
H  -1.09271 -1.98729 -2.558362
H  -1.208529 -3.698173 -2.05881
H  -2.688331 -2.79991 -2.517796
H  -2.274474 -4.378388 0.037196
H  -2.650976 -3.200977 1.320123
H  -3.763832 -3.388123 -0.08143
H  -1.263211 0.132591 1.78663
H  -2.800138 4.072342 -0.019213
H  -3.281538 3.584104 1.644001
H  -5.066226 0.718137 -0.541441
H  3.00668 2.50619 -1.257233
H  -5.347117 2.818118 0.46217
H  6.100644 0.146234 0.700038
H  5.439729 -1.893328 1.533188
H  5.318573 3.167385 -0.996892
