program: Gaussian 09
title: 000188892
version: EM64L-G09RevD.01
frameworkgroup: C1[X(C15H23NOS)]
method: RPBEPBE
basis: SDD
operation: Freq
keyword: #p
keyword: freq=noraman
keyword: PBEPBE/SDD
title: #p freq=noraman PBEPBE/SDD
converged: YES YES NO NO
title: Mulliken charges:
elementType: S O N C C C C C C C C C C C C C C C H H H H H H H H H H H H H H H H H H H H H H H
charge: 0.091239 -0.244200 -0.056903 -0.391716 -0.452956 -0.333526 -0.550662 -0.338334 0.507031 -0.054588 -0.694957 -0.392742 -0.422141 -0.228646 -0.224580 -0.586152 -0.241731 -0.622905 0.202201 0.250268 0.238874 0.269082 0.227000 0.186264 0.207081 0.243389 0.189889 0.203082 0.210393 0.217483 0.216833 0.245112 0.229829 0.225444 0.224188 0.245835 0.292542 0.228371 0.220241 0.250448 0.214619
chargesum: 0.00000
title: Mulliken charges with hydrogens summed into heavy atoms:
elementType: S O N C C C C C C C C C C C C C C C
charge: 0.091239 -0.244200 -0.056903 0.060753 0.055001 0.079737 -0.100191 0.054636 0.507031 -0.054588 -0.050247 -0.147630 -0.192312 -0.003203 -0.000392 -0.047775 -0.013360 0.062404
polarizability: 2.22680992e+02 1.28830298e+01 2.21887211e+02 1.85745865e+01 -1.60007782e+01 1.29000809e+02
1716.lowfreq: -11.6098 -4.6465 -0.0012 0.0016 0.0017 6.0261 15.7637 24.2176 27.4711
frequency: 13.5735 24.0201 27.2033 38.1180 40.7195 59.2516 71.0290 73.8493 80.5630 104.3310 117.5200 172.5498 185.7803 219.3891 241.4510 253.0696 264.0016 281.1276 320.8857 337.2553 345.1155 391.2585 403.8629 412.3564 445.1896 501.1597 518.8000 570.6634 617.6537 618.0037 625.4406 684.6124 708.3346 734.9107 753.5635 759.5888 786.2561 792.5684 824.0860 856.8906 889.9112 903.6358 921.4021 934.7688 978.0166 983.5027 989.8040 994.9795 1011.4177 1013.2723 1021.7229 1026.8677 1059.6048 1070.6500 1074.0984 1085.1593 1110.1800 1112.7773 1142.2657 1172.5331 1187.9801 1199.8188 1218.4115 1241.0144 1255.0716 1266.0093 1270.7903 1284.2507 1289.9927 1292.1933 1299.4513 1328.5652 1341.4701 1352.7822 1360.4361 1379.5468 1383.1556 1389.8207 1389.9941 1429.0587 1441.3275 1452.0467 1465.5183 1468.1529 1473.8524 1477.0448 1478.4619 1478.9473 1484.1631 1486.8152 1488.5355 1592.7885 1614.4327 1622.3088 2964.6678 2974.8343 2976.1094 2981.0508 2991.8034 2994.9307 3005.8306 3010.3687 3033.0149 3041.9917 3047.3029 3070.6216 3071.9217 3074.2889 3074.6814 3077.4523 3091.9749 3113.2014 3115.9488 3118.6036 3131.4840 3143.8018 3162.3356
redmass: 3.8021 3.6721 3.8677 2.6985 4.0260 4.0403 5.8616 1.7712 4.4156 2.7239 3.5979 3.6183 1.6637 3.8042 1.1309 1.6309 3.8293 2.1761 3.4680 2.5641 3.4891 2.8753 2.8360 4.1109 6.0481 3.2354 3.9597 5.9014 5.9747 5.7845 10.3971 4.2204 1.7134 1.0853 1.1865 1.8866 1.2541 1.2402 3.1928 1.2460 2.7503 1.8186 1.5665 1.3639 1.3864 1.7329 6.1916 1.3486 1.7789 4.2225 3.7594 2.1982 1.3209 2.3324 2.5114 1.6057 1.8845 2.2439 1.5080 1.0533 1.1213 2.0524 2.4198 1.8013 1.2074 1.2770 1.3927 1.2022 1.2009 1.2088 1.2770 1.2597 1.3791 1.3143 1.3860 2.2827 5.4301 1.2096 1.2106 1.1005 2.1773 1.0849 1.0409 1.0710 1.1236 1.0688 1.0466 1.0464 2.2347 1.0970 1.0816 6.0274 6.1929 8.0315 1.0590 1.0419 1.0561 1.0372 1.0634 1.0606 1.0602 1.0966 1.0592 1.0992 1.1013 1.1019 1.1043 1.0960 1.0995 1.1028 1.1014 1.0873 1.0874 1.1059 1.0905 1.0957 1.1014
irintensity: 0.0276 0.0217 0.1068 0.2727 0.6603 0.1395 0.5282 0.0780 2.2622 0.7589 1.0220 0.0321 4.5530 0.4624 0.5086 0.8333 2.7493 6.6317 10.0277 3.1589 1.2492 8.4809 0.1524 5.9996 3.7173 21.8578 7.5765 11.9725 2.8923 6.9706 11.4854 20.3229 52.1772 12.6586 6.6677 40.2878 0.1634 6.7537 12.0948 0.0901 4.7803 18.7616 1.6957 19.2102 0.1519 41.3854 0.0508 0.1547 40.8768 9.7961 1.9089 10.9390 0.8741 8.8900 0.2884 7.9652 39.8379 11.3583 169.6212 0.9040 0.2256 12.8532 0.0386 43.8548 5.2003 4.1437 41.0732 3.4958 2.2055 5.8421 17.7266 1.2798 1.2735 16.4589 4.9903 62.4698 17.3434 10.9853 18.5990 32.6065 8.1214 21.5738 13.9632 0.7869 4.2555 9.5190 9.7929 8.0673 24.3608 14.1814 19.9454 1.1918 45.5952 286.5022 23.3633 24.6633 39.8660 36.3394 25.8266 30.6199 29.8962 9.2922 20.7341 15.8829 0.0839 25.2986 27.1630 37.9943 48.2166 67.5884 9.2295 9.4358 6.7191 13.6727 9.3494 40.5963 26.2088
temp: 298.150 k
press: 1.00000 atm
elementType: 16 8 7 6 6 6 6 6 6 6 6 6 6 6 6 6 6 6 1 1 1 1 1 1 1 1 1 1 1 1 1 1 1 1 1 1 1 1 1 1 1
symmnumber: 1
zpe: 916489.0 jmol-1
zpe.correction: 0.349072 hartree
zpe.thermalcorrener: 0.369699 hartree
zpe.thermalcorrenthalpy: 0.370643 hartree
zpe.thermalcorrgfe: 0.295078 hartree
zpe.sumelectzpe: -1112.058052 hartree
zpe.sumelectthermal: -1112.037425 hartree
zpe.sumelectthermalent: -1112.036481 hartree
zpe.sumelectthermalfe: -1112.112046 hartree
dipole: -1.2969 -1.7261 0.0726
dipole: 2.1602
quadrupole: -119.9249 -105.4316 -119.5916
quadrupole: -1.1967 1.8068 -4.1742
quadrupole: -4.9422 9.5511 -4.6089 -1.1967 1.8068 -4.1742
hfenergy: -1112.4071239 hartree
pointgroup: C01 [X(C15H23N1O1S1)]
dipole: -0.522703 -0.667906 0.0547398 debye
polarizability: 222.8451927|13.8452398|219.7540564|18.433863|-20.3481272|130.969762 unknown
InChI: InChI=1S/C15H23NOS/c1-3-5-12-16(15(17)18-4-2)13-11-14-9-7-6-8-10-14/h6-10H,3-5,11-13H2,1-2H3
charge 0 multiplicity 1
41 atoms
S  0.882725 2.517191 -0.948566
O  3.136681 1.377848 0.186189
N  1.287974 -0.041673 0.019693
C  2.036359 -1.161092 0.649001
C  -0.116956 -0.27869 -0.369235
C  2.73288 -2.076986 -0.382476
C  -1.129378 0.073897 0.761438
C  3.45759 -3.263174 0.293373
C  -2.562824 -0.15358 0.308055
C  1.940118 1.160409 -0.149734
C  4.163521 -4.184485 -0.724279
C  -3.222312 0.818865 -0.489399
C  -3.254507 -1.35032 0.626679
C  -4.538349 0.602053 -0.953888
C  -4.571849 -1.571715 0.163617
C  2.159344 3.913687 -0.829174
C  -5.218043 -0.595701 -0.629476
C  2.093308 4.654149 0.512346
H  1.319715 -1.745708 1.258599
H  2.789936 -0.725998 1.32834
H  -0.221967 -1.345585 -0.640568
H  -0.359151 0.304889 -1.275567
H  3.459087 -1.473463 -0.95969
H  1.985648 -2.463175 -1.105875
H  -0.900486 -0.541925 1.651796
H  -0.971921 1.132894 1.036682
H  2.72746 -3.854494 0.883901
H  4.201803 -2.872393 1.016642
H  3.439023 -4.613834 -1.441761
H  4.677719 -5.023246 -0.220371
H  4.919677 -3.624831 -1.305909
H  -2.701085 1.752369 -0.737514
H  -2.761254 -2.108867 1.248036
H  -5.035036 1.365394 -1.563603
H  -5.094149 -2.499489 0.423908
H  1.935163 4.566852 -1.689069
H  3.140022 3.430964 -0.971874
H  -6.240174 -0.764084 -0.98679
H  1.092148 5.08388 0.691451
H  2.336259 3.968082 1.341393
H  2.831076 5.479885 0.524782
