program: Gaussian 09
title: 000017374
version: EM64L-G09RevD.01
frameworkgroup: C1[X(C8H7BrClNO)]
method: RPBEPBE
basis: SDD
operation: Freq
keyword: #p
keyword: freq=noraman
keyword: PBEPBE/SDD
title: #p freq=noraman PBEPBE/SDD
converged: NO YES NO NO
title: Mulliken charges:
elementType: Br Cl O N C C C C C C C C H H H H H H H
charge: 0.013720 -0.072934 -0.247117 -0.437291 0.497240 -0.432107 -0.329745 -0.149519 -0.165417 -0.236435 0.251902 -0.668040 0.235526 0.311719 0.323686 0.252478 0.251922 0.300185 0.300227
chargesum: 0.00000
title: Mulliken charges with hydrogens summed into heavy atoms:
elementType: Br Cl O N C C C C C C C C
charge: 0.013720 -0.072934 -0.247117 -0.113605 0.497240 -0.196581 -0.018026 0.102959 0.086505 -0.236435 0.251902 -0.067628
polarizability: 2.12672285e+02 4.09938981e+00 1.19390913e+02 1.09670966e-02 9.51115506e-03 4.80023177e+01
1716.lowfreq: -7.4844 -2.7533 0.0019 0.0023 0.0030 4.2410 36.9587 56.6421 81.0478
frequency: 36.9517 56.6382 81.0443 84.4480 148.0122 150.2957 223.0327 284.8392 327.2481 357.5613 391.0656 409.6628 501.7530 504.5344 567.9150 621.5316 675.9822 680.5166 709.4417 730.4065 823.0736 841.0537 849.4466 904.5488 942.5200 948.2913 985.3608 991.0549 1062.7224 1118.7255 1150.4867 1188.8902 1210.7172 1257.1651 1266.4467 1300.0933 1371.1678 1399.1512 1419.3884 1475.7511 1526.0271 1595.0888 1602.3872 1606.9470 3070.8608 3128.3247 3152.9858 3166.2953 3173.3313 3193.3288 3455.3169
redmass: 7.0523 4.5196 3.5678 13.5446 5.2900 17.8141 9.0537 8.4506 5.1972 7.7150 9.1784 2.9670 6.1839 2.8050 3.1015 7.1630 6.5466 6.5438 3.2858 1.1746 1.3683 5.6625 1.4328 1.7202 6.5651 1.3677 1.3294 4.8976 2.5036 1.3481 1.1116 1.1205 3.8903 1.2316 1.8433 1.3658 5.6609 3.7266 1.1015 2.4230 2.4063 4.7275 5.8364 6.5106 1.0565 1.0903 1.1094 1.0909 1.0953 1.0959 1.0765
irintensity: 1.6254 0.1588 16.5736 0.0376 0.0376 3.8645 0.0493 20.6956 0.3664 18.1631 1.2376 0.0116 4.1061 33.8014 3.4944 0.2138 27.0841 86.6209 4.8258 38.1012 43.4153 6.0393 67.6192 11.7549 0.5326 2.6165 2.8479 42.0405 31.1079 16.9730 0.4667 1.8982 4.2686 19.9625 8.8687 7.0306 61.4703 31.5019 21.5840 120.8166 460.6982 99.1969 42.1966 161.8216 3.5664 10.6822 0.5845 3.3395 2.7876 6.2363 83.7822
temp: 298.150 k
press: 1.00000 atm
elementType: 35 17 8 7 6 6 6 6 6 6 6 6 1 1 1 1 1 1 1
symmnumber: 1
zpe: 351222.6 jmol-1
zpe.correction: 0.133774 hartree
zpe.thermalcorrener: 0.145274 hartree
zpe.thermalcorrenthalpy: 0.146218 hartree
zpe.thermalcorrgfe: 0.093404 hartree
zpe.sumelectzpe: -911.696022 hartree
zpe.sumelectthermal: -911.684521 hartree
zpe.sumelectthermalent: -911.683577 hartree
zpe.sumelectthermalfe: -911.736392 hartree
dipole: 1.7522 -1.7030 0.0143
dipole: 2.4435
quadrupole: -87.0491 -86.1139 -88.6844
quadrupole: -0.4263 0.0590 0.0177
quadrupole: 0.2334 1.1685 -1.4019 -0.4263 0.0590 0.0177
hfenergy: -911.8297952 hartree
pointgroup: C01 [X(C8H7Br1Cl1N1O1)]
dipole: -0.5804671 -0.7476544 0.168008 debye
dipolederiv: -0.8062892 -0.1006906 -0.046875 -0.1148571 -0.0756789 0.0013934 -0.0427586 0.0028565 -0.0389551 -0.3856389 -0.0939066 0.0057944 -0.3591545 -0.5732201 0.0941103 0.0893578 0.121473 -0.185232 -0.7732316 -0.2095622 0.0219055 0.5578691 -0.876733 0.2193812 -0.2167525 0.1412025 -0.4138571 -1.7668266 0.1273417 -0.1895185 0.3183307 -0.4401672 0.0796273 -0.249612 0.0599259 -0.3295196 1.1739972 0.0705782 0.0863473 0.2465571 0.0361445 0.0468769 0.0324992 0.0289353 0.1011887 -0.1762733 0.0096627 -0.0014802 0.0612163 0.0181486 -0.0590947 -0.0175932 -0.0643289 -0.1734044 -0.187142 -0.0201642 0.0025959 -0.0760392 -0.0697024 -0.0336101 0.0197009 -0.0276239 -0.1424559 -0.2990558 -0.1038908 0.010119 -0.122872 0.0296932 -0.0467515 0.0160231 -0.0447823 -0.0653257 -0.3427912 0.0211194 -0.0329381 0.0117744 0.0803851 -0.0494833 -0.0300423 -0.0485509 -0.0706094 1.2955719 0.2026179 0.0827737 0.2132088 -0.0141618 -0.0187452 0.0798273 -0.0198005 -0.1293656 1.5786919 0.0847653 0.1145634 -1.1245248 0.911126 -0.3353487 0.4927931 -0.2124026 0.3046067 -0.0112994 0.0060745 -0.0188369 0.3783382 0.7217476 -0.1415824 -0.1370914 -0.1800659 0.1921123 0.0089371 -0.1002624 0.0147596 -0.0858081 -0.0299567 0.0539819 0.0101844 0.0524927 0.1560122 0.141922 0.0577228 -0.0220937 0.0142594 0.0954926 0.0287975 -0.008771 0.0330055 0.172309 0.3425372 0.0816664 -0.0203129 0.1111978 0.1930904 0.042013 -0.0300546 0.0392864 0.2768239 0.0366092 0.0664285 -0.0332794 0.0684085 0.027649 0.0485856 -0.0338666 0.0483245 0.143093 0.0672881 -0.052891 0.0073821 -0.0618052 -0.0072789 0.0449076 0.0101436 0.0457665 0.1439858 0.0636496 -0.0376337 -0.0289704 -0.04748 0.004317 0.0469169 -0.0695902 0.0239829 -0.0011006 0.0393439 -0.0089761 0.0480643 0.0113806 -0.0308951 -0.0219758 0.0856028 0.0003033 0.0596938 unknown
polarizability: 210.3391123|13.7904257|114.4855408|12.1483638|-19.2999046|55.240863 unknown
InChI: InChI=1S/C8H7BrClNO/c9-6-1-3-7(4-2-6)11-8(12)5-10/h1-4,11H,5H2
charge 0 multiplicity 1
19 atoms
Br 4.859662 0.404976 0.21341
Cl -3.835224 -2.18192 0.140204
O  -2.171547 1.418243 -0.810052
N  -1.24826 -0.630255 -0.083593
C  0.145184 -0.338751 -0.032366
C  1.015175 -1.382153 0.380518
C  0.680423 0.931555 -0.373455
C  2.405889 -1.168929 0.454838
C  2.073737 1.144284 -0.298714
C  2.923332 0.097931 0.112686
C  -2.279635 0.206516 -0.447117
C  -3.698956 -0.370374 -0.415877
H  0.609708 -2.366155 0.645795
H  0.011838 1.734077 -0.690002
H  -1.530231 -1.581269 0.183875
H  3.070487 -1.976592 0.773231
H  2.48693 2.122315 -0.561056
H  -4.134113 -0.331528 -1.42505
H  -4.315898 0.208631 0.286525
