program: Gaussian 09
title: 000188883
version: EM64L-G09RevD.01
frameworkgroup: C1[X(C14H21NOS)]
method: RPBEPBE
basis: SDD
operation: Freq
keyword: #p
keyword: freq=noraman
keyword: PBEPBE/SDD
title: #p freq=noraman PBEPBE/SDD
converged: YES YES NO NO
title: Mulliken charges:
elementType: S O N C C C C C C C C C C C C C C H H H H H H H H H H H H H H H H H H H H H
charge: 0.083015 -0.259850 -0.088952 -0.021562 -0.440474 -0.543879 -0.659824 -0.676109 -0.658163 -0.007547 0.508906 -0.624628 -0.392171 -0.427692 -0.229873 -0.223608 -0.242498 0.232954 0.277405 0.208489 0.238178 0.218740 0.200733 0.278044 0.229193 0.228968 0.215463 0.277939 0.200143 0.219213 0.255308 0.225453 0.245826 0.246352 0.229503 0.225436 0.223662 0.227907
chargesum: 0.00000
title: Mulliken charges with hydrogens summed into heavy atoms:
elementType: S O N C C C C C C C C C C C C C C
charge: 0.083015 -0.259850 -0.088952 -0.021562 0.069886 -0.097212 0.037693 -0.002485 0.039132 -0.007547 0.508906 0.101959 -0.145819 -0.198189 -0.004437 0.000054 -0.014591
polarizability: 2.57848021e+02 9.24476108e+00 1.77377064e+02 -1.16776519e+01 8.11633378e+00 1.12497879e+02
1716.lowfreq: -15.4053 -2.6332 -0.0013 0.0011 0.0023 5.4434 18.6438 23.8682 31.6405
frequency: 18.1024 23.6674 31.4222 40.6799 56.6355 71.6095 85.1558 111.0595 135.9023 153.1532 203.0942 222.1827 240.3316 253.2091 264.5497 278.2259 287.8218 312.7358 341.8469 363.0648 378.0261 386.7174 402.9390 407.2225 448.3180 482.6278 500.7668 529.2917 593.1187 617.5382 626.6491 662.8066 706.0762 756.6645 784.2500 793.1824 814.4663 855.5982 897.0840 923.5776 928.6342 931.4325 958.6200 977.0398 989.8131 994.0929 1014.9930 1018.3158 1023.6745 1026.9861 1029.5967 1060.7065 1088.5744 1110.2903 1151.3196 1167.8874 1172.1477 1187.4536 1215.6350 1239.9412 1240.6067 1244.5551 1278.3370 1288.9598 1328.3403 1349.6043 1362.4920 1373.2617 1375.3660 1382.4398 1397.8813 1440.5137 1441.9513 1445.9023 1455.2016 1465.2531 1466.4650 1467.3511 1472.0686 1478.9117 1480.5946 1483.9949 1488.2095 1500.1071 1592.8559 1599.1095 1614.3696 2971.9746 2973.6542 2974.4359 2979.0320 2993.8027 3009.7105 3051.6554 3057.2483 3066.2273 3068.6452 3075.2324 3086.2009 3090.2931 3096.6872 3108.5581 3111.8525 3113.4402 3117.1811 3131.5400 3143.5158 3161.9971
redmass: 3.7578 4.0207 3.5396 3.5842 3.2617 1.3573 3.7133 4.9907 3.3324 4.0184 1.0224 3.4417 2.7526 1.0965 1.8698 1.3913 2.8749 3.0877 2.8735 3.4395 3.0849 2.3951 2.8220 2.9440 5.3432 3.8029 3.2311 4.4451 5.0834 6.3944 10.0969 5.3341 1.7930 1.7874 1.2857 3.2460 3.6571 1.2466 2.7798 1.7363 1.5811 1.5774 1.2042 1.3868 6.1949 1.3380 2.2599 2.7319 1.4603 2.2065 1.4235 1.6716 1.6172 1.3050 1.5192 1.8125 1.0587 1.1181 2.4661 2.9553 2.9653 2.7712 1.6827 1.4257 1.2656 1.8483 1.2928 1.2033 1.2050 7.9593 1.2083 1.6618 1.3901 1.0462 1.1248 1.0497 1.0505 1.0493 1.0608 1.1382 1.0505 2.1504 1.0756 1.0517 6.0826 6.9821 6.1563 1.0386 1.0363 1.0368 1.0371 1.0592 1.0633 1.1007 1.0994 1.0958 1.0968 1.0972 1.1004 1.1028 1.1003 1.1004 1.0997 1.0871 1.0871 1.0908 1.0958 1.1015
irintensity: 0.1773 0.0999 0.3751 2.2460 2.4227 1.3536 0.3848 0.5431 5.2908 0.0502 0.0399 1.9317 0.8778 0.3259 0.7581 0.4003 2.3680 8.0043 2.8863 4.7917 1.0906 0.0032 1.0365 14.0797 8.1967 3.6679 18.4747 19.7984 5.4684 0.3267 9.6908 34.8530 50.0266 43.7376 4.6781 1.1800 14.4602 0.0543 16.0542 3.3076 0.6241 4.3108 0.2279 0.0376 0.2100 0.0105 5.6902 11.9787 0.4121 11.9391 1.2913 269.7010 43.3249 8.0698 148.1996 45.8711 0.0402 0.1450 6.1848 5.4960 6.4617 47.7275 127.3312 36.6373 0.9962 54.3443 20.2419 35.2876 32.1703 0.0421 27.1645 15.6139 2.0631 1.4219 20.3701 12.1052 1.0327 22.0378 12.7896 10.1513 8.5436 23.1563 50.0395 28.3164 9.8081 190.1950 12.3295 26.1570 38.1535 14.0097 74.9508 19.8924 40.6823 12.1496 20.5660 16.6747 3.1301 59.1291 30.3176 10.9200 25.6322 3.8574 11.0269 9.9223 5.4590 10.8944 41.9545 26.1356
temp: 298.150 k
press: 1.00000 atm
elementType: 16 8 7 6 6 6 6 6 6 6 6 6 6 6 6 6 6 1 1 1 1 1 1 1 1 1 1 1 1 1 1 1 1 1 1 1 1 1
symmnumber: 1
zpe: 838858.0 jmol-1
zpe.correction: 0.319504 hartree
zpe.thermalcorrener: 0.338985 hartree
zpe.thermalcorrenthalpy: 0.339929 hartree
zpe.thermalcorrgfe: 0.268904 hartree
zpe.sumelectzpe: -1072.834874 hartree
zpe.sumelectthermal: -1072.815393 hartree
zpe.sumelectthermalent: -1072.814449 hartree
zpe.sumelectthermalfe: -1072.885474 hartree
dipole: 0.3880 1.9457 0.1772
dipole: 1.9920
quadrupole: -99.6323 -103.4230 -114.6261
quadrupole: 4.1047 -2.7147 0.1967
quadrupole: 6.2615 2.4708 -8.7323 4.1047 -2.7147 0.1967
hfenergy: -1073.1543783 hartree
pointgroup: C01 [X(C14H21N1O1S1)]
dipole: 0.1194191 0.7732826 -0.0441766 debye
polarizability: 255.5306258|10.6122455|179.0939374|-19.776926|-2.2508885|113.0984006 unknown
InChI: InChI=1S/C14H21NOS/c1-14(2,3)17-13(16)15(4)11-10-12-8-6-5-7-9-12/h5-9H,10-11H2,1-4H3
charge 0 multiplicity 1
38 atoms
S  -3.350553 0.881295 0.241489
O  -1.359728 -1.038948 -0.054148
N  -0.706966 1.174247 -0.404007
C  -4.404779 -0.722855 0.600378
C  0.694739 0.747035 -0.622886
C  1.544719 0.769792 0.681582
C  -3.841241 -1.440448 1.842825
C  -5.810705 -0.143854 0.876263
C  -4.406047 -1.628676 -0.647053
C  -1.636879 0.194691 -0.098055
C  2.96481 0.293292 0.418158
C  -1.0138 2.61577 -0.366498
C  3.236029 -1.09169 0.260046
C  4.035204 1.21304 0.277887
C  4.542081 -1.544621 -0.029055
C  5.344404 0.764053 -0.011689
C  5.601877 -0.617327 -0.167321
H  1.148717 1.409216 -1.383509
H  0.675955 -0.279548 -1.024062
H  1.552875 1.795381 1.096939
H  1.044386 0.113278 1.417427
H  -3.839001 -0.771096 2.721081
H  -4.479375 -2.316048 2.076124
H  -2.815558 -1.796676 1.65696
H  -6.202903 0.404386 0.001022
H  -5.804649 0.53791 1.745491
H  -6.502815 -0.978478 1.0978
H  -3.388868 -1.988005 -0.869995
H  -5.055416 -2.506192 -0.456177
H  -4.800751 -1.091549 -1.52746
H  -1.944906 2.832247 -0.919299
H  -0.189014 3.162933 -0.852281
H  -1.12931 2.993669 0.667409
H  2.41883 -1.815415 0.372623
H  3.842772 2.286279 0.403228
H  4.734905 -2.617449 -0.143233
H  6.161016 1.488272 -0.111864
H  6.616043 -0.967809 -0.38964
