program: Gaussian 09
title: 000188880
version: EM64L-G09RevD.01
frameworkgroup: C1[X(C14H21NOS)]
method: RPBEPBE
basis: SDD
operation: Freq
keyword: #p
keyword: freq=noraman
keyword: PBEPBE/SDD
title: #p freq=noraman PBEPBE/SDD
converged: YES YES NO NO
title: Mulliken charges:
elementType: S O N C C C C C C C C C C C C C C H H H H H H H H H H H H H H H H H H H H H
charge: 0.066760 -0.254346 -0.110515 -0.251891 -0.014824 0.472867 -0.723054 -0.700150 -0.699766 -0.033246 -0.375907 -0.410294 -0.236650 -0.239319 -0.237243 -0.588585 -0.621097 0.255818 0.217058 0.228757 0.243566 0.212841 0.209441 0.262510 0.219931 0.206271 0.258340 0.236070 0.255070 0.244753 0.229618 0.225467 0.230126 0.294404 0.246700 0.221189 0.245228 0.214104
chargesum: 0.00000
title: Mulliken charges with hydrogens summed into heavy atoms:
elementType: S O N C C C C C C C C C C C C C C
charge: 0.066760 -0.254346 -0.110515 0.003927 0.202234 0.472867 -0.037891 -0.008269 0.000915 -0.033246 -0.120836 -0.165541 -0.007032 -0.013853 -0.007117 -0.047481 0.059424
polarizability: 2.35611003e+02 9.52750035e+00 1.55583317e+02 2.65956762e+00 1.06601707e+01 1.48905002e+02
1716.lowfreq: -6.8115 -0.0013 0.0009 0.0016 8.8409 10.7208 21.6500 30.2725 36.6305
frequency: 21.2871 29.9184 36.4240 43.0129 70.2847 75.9381 106.8606 138.8415 171.2371 189.6321 208.2337 220.4812 223.8140 243.6142 253.8644 280.8129 285.9099 288.3862 322.9741 349.1237 387.3380 401.5307 413.5017 453.1376 473.9016 491.4540 520.3415 609.8746 615.5439 617.6738 628.8438 646.9393 705.5905 753.2974 764.3974 775.5899 807.3622 857.4098 892.8795 923.9311 926.0990 944.4180 974.0700 981.0279 983.1033 991.5240 998.5108 1020.7152 1042.5606 1057.5407 1064.5622 1069.3072 1103.0462 1113.1726 1138.7047 1143.0028 1173.7629 1192.3894 1194.2432 1209.9388 1238.3006 1255.9640 1285.7795 1286.8811 1312.8556 1330.7894 1354.1021 1374.3158 1383.2477 1387.1516 1389.6999 1394.6435 1403.5775 1430.7255 1437.6333 1459.4802 1465.6594 1473.2358 1476.4633 1477.2837 1481.1035 1484.2833 1487.9495 1500.0073 1592.9613 1613.2384 1619.7461 2980.3885 2987.5065 2991.0684 2993.2592 3012.7699 3014.5637 3029.4818 3073.6999 3078.7709 3086.1419 3086.6697 3090.0259 3096.7072 3107.5830 3115.5753 3116.0167 3119.5137 3126.7679 3139.8079 3150.9726 3164.7651
redmass: 4.2088 3.3252 3.2525 4.1057 3.7878 4.4867 3.5046 3.0104 2.9312 3.0439 1.9674 1.4303 1.8174 1.6397 1.5103 2.0108 2.3889 1.1345 3.4323 3.7481 3.6164 2.8230 3.9315 5.7834 3.2779 3.2844 4.2625 5.0350 5.4219 5.9962 7.9605 3.2992 1.7077 1.2005 2.2841 2.8803 2.5319 1.2461 2.5902 1.1985 1.3853 1.4217 2.0071 1.3879 1.7593 5.6428 1.3183 2.2923 1.6075 1.3366 2.2820 2.2833 2.0402 1.9475 2.4906 2.3314 1.0520 1.2038 2.1265 2.1829 2.6976 1.2366 1.2455 1.6427 1.3833 1.3052 1.2302 1.2105 7.6941 1.2807 1.2092 1.2147 1.3991 1.0994 2.1929 1.0436 1.0409 1.0544 1.0491 1.0458 1.0796 1.9774 1.0922 1.0572 6.0691 5.9808 8.2144 1.0373 1.0362 1.0363 1.0369 1.0830 1.0829 1.0591 1.0957 1.0995 1.0990 1.0989 1.1019 1.1000 1.0999 1.0999 1.1054 1.0867 1.0867 1.0919 1.0951 1.1012
irintensity: 0.0293 0.1574 0.1539 1.5851 1.2177 0.7410 1.4586 0.5256 0.1571 1.0199 2.7335 2.6161 1.2917 2.1947 1.8274 9.1212 1.3432 0.4966 3.2105 4.0942 5.4510 0.2284 0.3597 3.3025 4.2859 22.5600 9.5344 6.6410 9.3631 0.9598 16.8046 13.8681 52.1203 8.8532 26.8585 26.0454 78.9202 0.0584 15.1147 5.2740 5.0747 0.1722 25.1514 0.3484 27.8355 0.6238 0.3998 25.4235 1.9961 1.8491 13.5768 5.8845 34.4538 23.8877 11.0082 13.9339 0.1420 9.0115 44.9353 26.8183 284.0241 4.2713 2.7896 38.3724 1.8033 2.0659 26.4616 24.9386 1.7903 52.9881 16.6818 19.2413 19.0302 31.2339 15.2436 2.3015 14.5598 24.6943 9.5461 6.0095 4.4132 13.4901 4.8902 10.6317 0.7664 2.2343 254.6131 40.7593 25.4212 20.0216 25.2161 11.9275 5.9787 21.0564 35.1356 29.7694 57.7905 7.2346 9.2289 27.4734 6.4324 18.5543 16.9381 3.2412 0.1644 15.8351 34.8934 22.5955
temp: 298.150 k
press: 1.00000 atm
elementType: 16 8 7 6 6 6 6 6 6 6 6 6 6 6 6 6 6 1 1 1 1 1 1 1 1 1 1 1 1 1 1 1 1 1 1 1 1 1
symmnumber: 1
zpe: 840867.2 jmol-1
zpe.correction: 0.320269 hartree
zpe.thermalcorrener: 0.339414 hartree
zpe.thermalcorrenthalpy: 0.340358 hartree
zpe.thermalcorrgfe: 0.271236 hartree
zpe.sumelectzpe: -1072.833917 hartree
zpe.sumelectthermal: -1072.814772 hartree
zpe.sumelectthermalent: -1072.813828 hartree
zpe.sumelectthermalfe: -1072.882950 hartree
dipole: 2.0860 0.2764 1.1947
dipole: 2.4197
quadrupole: -102.7184 -110.9992 -108.8545
quadrupole: 5.0687 -1.2710 5.8739
quadrupole: 4.8057 -3.4752 -1.3305 5.0687 -1.2710 5.8739
hfenergy: -1073.1541863 hartree
pointgroup: C01 [X(C14H21N1O1S1)]
dipole: -0.8204786 -0.169474 0.4520567 debye
polarizability: 234.1822896|14.5613986|157.5376141|-0.1832491|-10.35259|148.3794178 unknown
InChI: InChI=1S/C14H21NOS/c1-5-17-14(16)15(11(2)3)12(4)13-9-7-6-8-10-13/h6-12H,5H2,1-4H3
charge 0 multiplicity 1
38 atoms
S  2.249391 1.714371 0.280438
O  2.577905 -0.674564 -1.070921
N  0.56927 -0.508646 0.11865
C  -0.315732 0.246187 1.06527
C  0.101869 -1.872257 -0.326026
C  -1.694922 0.493828 0.429928
C  -0.342465 -0.433866 2.450305
C  1.022217 -2.997394 0.200933
C  -0.092207 -1.942502 -1.857801
C  1.787297 -0.04136 -0.318758
C  -1.763833 1.282323 -0.74959
C  -2.896835 -0.018483 0.974949
C  -3.001842 1.548548 -1.369994
C  -4.140823 0.243868 0.353092
C  -4.198053 1.026412 -0.820772
C  3.991797 1.767175 -0.463679
C  5.060781 1.253923 0.50955
H  0.151796 1.238174 1.204129
H  -0.894324 -1.985404 0.141734
H  -0.945135 0.160638 3.15991
H  0.685518 -0.503257 2.844622
H  -0.765036 -1.453842 2.411218
H  0.586698 -3.980848 -0.055078
H  2.021867 -2.927089 -0.257459
H  1.132328 -2.942845 1.298679
H  -0.530234 -2.92102 -2.12797
H  0.872236 -1.833852 -2.379416
H  -0.779204 -1.149359 -2.200216
H  -0.837607 1.687471 -1.175971
H  -2.874157 -0.619985 1.889846
H  -3.037182 2.162751 -2.276825
H  -5.062145 -0.160906 0.78718
H  -5.161259 1.231615 -1.301167
H  3.941786 1.142189 -1.370827
H  4.142439 2.823225 -0.743292
H  5.067248 1.832404 1.449975
H  4.883796 0.192176 0.752036
H  6.063552 1.336298 0.04672
