program: Gaussian 09
title: 000196866
version: EM64L-G09RevD.01
frameworkgroup: C1[X(C21H22N2O3)]
method: RPBEPBE
basis: SDD
operation: Freq
keyword: #p
keyword: freq=noraman
keyword: PBEPBE/SDD
title: #p freq=noraman PBEPBE/SDD
converged: YES YES NO NO
title: Mulliken charges:
elementType: O O O N N C C C C C C C C C C C C C C C C C C C C C H H H H H H H H H H H H H H H H H H H H H H
charge: -0.261735 -0.250978 -0.442884 -0.038411 -0.223299 0.231076 -0.264170 -0.236136 -0.118585 -0.219992 -0.532854 -0.533949 0.234514 -0.403487 -0.110940 0.343738 -0.638953 0.217047 -0.569596 0.109174 0.018455 -0.434119 -0.414390 -0.350735 -0.257193 -0.222570 0.275072 0.236129 0.245005 0.222812 0.226573 0.234089 0.245350 0.231462 0.229529 0.199340 0.231307 0.276137 0.229508 0.260796 0.255135 0.239629 0.209225 0.214389 0.302327 0.225071 0.227532 0.354553
chargesum: 0.00000
title: Mulliken charges with hydrogens summed into heavy atoms:
elementType: O O O N N C C C C C C C C C C C C C C C C C C C C C
charge: -0.261735 -0.250978 -0.088331 -0.038411 -0.223299 0.231076 0.010902 -0.000007 0.126420 0.002820 -0.072192 -0.057137 0.234514 0.025382 0.120367 0.343738 -0.133309 0.217047 -0.053665 0.109174 0.018455 -0.194489 0.009224 -0.048408 -0.032122 0.004962
polarizability: 2.97706050e+02 1.13230782e+01 2.47175550e+02 -1.59306955e+01 -5.70095931e+00 1.59118548e+02
1716.lowfreq: -11.9486 -8.9746 -0.0009 -0.0006 0.0005 12.3471 48.1325 75.6035 93.2482
frequency: 48.0886 75.5933 93.2299 104.0824 114.3227 137.3994 164.3401 221.1372 229.7387 233.2134 251.3265 267.9384 269.7715 282.0454 296.8687 321.5977 331.8251 356.5818 374.5046 398.7097 418.3286 425.9607 440.1010 448.8129 461.0708 485.5037 504.9360 530.7002 537.0528 543.7068 564.5986 574.2541 594.7506 620.7581 641.0758 658.2450 665.6198 676.4536 710.4489 744.5941 756.1833 756.9184 765.4482 780.1442 798.7859 841.7891 877.0192 881.9854 884.2327 898.9033 925.9675 932.9012 940.4682 945.7601 950.6495 962.1800 978.2700 986.9758 992.3534 1004.3189 1017.0491 1023.3162 1028.6878 1033.8424 1061.5876 1070.3912 1081.3889 1088.4599 1097.0597 1101.4057 1119.2488 1123.7052 1133.6126 1160.2903 1166.9020 1168.4539 1174.7676 1180.9923 1197.1774 1202.0237 1216.7004 1223.4656 1235.4314 1241.0663 1249.2460 1261.2677 1273.1363 1276.9978 1286.4162 1288.5016 1290.7178 1293.8843 1298.5242 1313.6986 1317.6303 1323.4862 1331.1109 1334.9449 1349.8142 1354.0286 1362.0947 1368.8388 1376.6186 1402.1319 1445.1702 1449.8420 1449.9734 1465.7635 1466.3336 1474.8900 1491.6519 1498.8167 1587.4793 1601.2433 1615.9985 1708.6554 2907.1617 2936.9234 2938.1698 2944.2210 2955.5764 2957.0140 2984.1616 2999.9562 3000.4095 3007.0837 3008.1955 3024.0704 3030.6975 3058.4928 3077.1356 3079.0409 3102.5559 3122.5493 3136.5717 3158.8486 3194.5787 3578.5660
redmass: 5.0668 5.5624 4.3786 4.9427 5.0551 3.5854 4.3874 3.8772 3.7208 3.3051 4.1958 3.7435 1.7925 2.5340 3.5965 3.7263 3.1089 4.1791 3.8081 4.0915 2.2767 3.7631 3.4953 4.4250 3.9520 3.7681 3.7330 4.1148 3.9365 4.1315 3.9288 3.9753 5.2497 4.4390 4.1120 4.7765 4.6952 5.3235 5.1100 3.1819 3.3450 4.3894 1.3855 3.5566 3.9112 1.9495 1.6711 2.5667 2.6110 3.9126 2.9993 3.4375 2.3660 1.4539 2.2933 2.8525 2.8777 1.3054 2.5618 3.8267 2.7469 2.3693 2.3367 2.1355 2.6874 2.3044 2.5491 2.3992 2.1958 2.0360 3.0082 2.7974 2.7013 2.0162 1.8384 1.1179 1.4841 1.3880 1.6121 1.5287 1.4628 1.6631 1.4606 1.7177 1.8435 1.5818 1.4022 1.6994 1.3575 1.5338 1.3492 1.4696 1.4232 1.5945 1.4088 1.4861 1.4493 1.5383 1.3638 1.4752 1.4914 1.8321 1.9392 5.1512 1.0913 2.0908 1.1938 1.1370 1.0973 2.8856 1.0774 1.0893 8.2763 7.4303 8.3115 8.0057 1.0709 1.0797 1.0803 1.0692 1.0844 1.0847 1.0681 1.0835 1.0686 1.0663 1.0635 1.0853 1.0991 1.1018 1.1044 1.0952 1.0956 1.0869 1.0904 1.0979 1.0954 1.0661
irintensity: 1.0614 1.9263 3.9968 0.1529 1.5024 0.0345 1.0090 4.4756 8.9949 7.4639 1.9834 2.5008 106.2307 25.8409 19.0934 3.9606 3.1667 3.4252 7.4297 6.7799 5.8763 7.2031 5.1467 9.3811 3.2796 4.2668 1.5253 10.5144 6.3406 1.3105 3.2256 2.4639 8.7277 4.3624 1.4037 2.3693 5.8657 12.1008 1.7993 5.1318 16.2972 0.6620 74.9384 0.9749 0.5854 4.2659 2.6280 2.5963 22.2929 4.2717 19.5574 6.9996 10.3195 6.7333 2.1116 8.2448 16.0005 1.1228 34.9902 28.1399 29.7105 22.9361 9.2548 19.6734 12.0669 16.4841 8.5578 60.7904 2.3651 7.2147 8.3024 4.7694 53.2147 21.8027 14.7527 2.7185 22.8420 10.4500 5.2553 21.4795 63.2649 8.0002 40.5293 11.6838 14.0342 11.4539 14.4911 28.6421 0.0549 15.9674 3.8144 14.2072 10.8401 21.6183 20.1959 0.7557 8.3405 7.4972 1.3308 8.5485 55.7046 36.6049 53.1620 34.6071 21.5230 46.6037 8.3179 3.5829 23.5894 130.5239 15.8855 1.0842 238.8944 26.6593 57.6354 20.2737 46.2890 69.5628 4.5141 32.9031 47.3957 59.4008 37.3147 8.9273 5.2985 14.3333 59.0778 65.3959 36.5957 32.4366 17.8289 6.0729 11.1220 4.1428 16.7245 32.4268 2.9400 28.3078
temp: 298.150 k
press: 1.00000 atm
elementType: 8 8 8 7 7 6 6 6 6 6 6 6 6 6 6 6 6 6 6 6 6 6 6 6 6 6 1 1 1 1 1 1 1 1 1 1 1 1 1 1 1 1 1 1 1 1 1 1
symmnumber: 1
zpe: 1032607.3 jmol-1
zpe.correction: 0.393299 hartree
zpe.thermalcorrener: 0.412607 hartree
zpe.thermalcorrenthalpy: 0.413552 hartree
zpe.thermalcorrgfe: 0.348023 hartree
zpe.sumelectzpe: -1146.705303 hartree
zpe.sumelectthermal: -1146.685995 hartree
zpe.sumelectthermalent: -1146.685051 hartree
zpe.sumelectthermalfe: -1146.750580 hartree
dipole: 3.4268 -1.0839 1.0944
dipole: 3.7571
quadrupole: -147.7604 -163.4583 -146.4735
quadrupole: 20.8723 -2.8873 2.2281
quadrupole: 4.8037 -10.8943 6.0906 20.8723 -2.8873 2.2281
hfenergy: -1147.0986028 hartree
pointgroup: C01 [X(C21H22N2O3)]
dipole: -1.3503321 0.4433041 0.4061946 debye
polarizability: 297.4630008|11.2896692|247.2297903|17.3295088|3.9484351|159.3073567 unknown
InChI: InChI=1S/C21H22N2O3/c24-15-10-26-16-8-18(25)23-14-4-2-1-3-13(14)21-5-6-22-9-12(15)11(7-17(21)22)19(16)20(21)23/h1-4,11,16-17,19-20,24H,5-10H2
charge 0 multiplicity 1
48 atoms
O  -2.436375 -2.259362 -0.34156
O  2.2411 -3.382141 -0.190877
O  -4.719701 0.375846 -0.763466
N  -1.308314 2.573921 -0.298283
N  1.358782 -1.224348 -0.430226
C  0.658827 1.108384 -0.355921
C  0.123234 -0.368554 -0.373033
C  -0.174328 2.06896 0.564386
C  -0.663576 -0.866502 0.865407
C  -1.614408 0.20838 1.467831
C  -0.706658 1.406861 1.851639
C  0.443775 1.790317 -1.74566
C  2.134901 0.930082 -0.028301
C  -1.045969 2.186865 -1.719163
C  -1.234526 -2.270235 0.525845
C  -2.730551 0.714093 0.542602
C  -2.669922 2.193327 0.1841
C  2.512774 -0.433594 -0.153518
C  -0.205073 -3.117022 -0.283892
C  1.241856 -2.606684 -0.289632
C  -3.661435 -0.136189 0.033543
C  3.106676 1.899122 0.275478
C  -3.621002 -1.633231 0.27456
C  3.848273 -0.857086 0.011921
C  4.453718 1.49399 0.459208
C  4.813173 0.131459 0.324928
H  -0.491714 -0.542418 -1.276196
H  0.482351 2.919518 0.839407
H  0.091782 -1.055617 1.660016
H  -2.059597 -0.222545 2.391386
H  -1.260966 2.151991 2.450264
H  0.145006 1.065365 2.469499
H  0.701651 1.122122 -2.585501
H  1.088523 2.685887 -1.810964
H  -1.268656 3.022991 -2.407269
H  -1.680795 1.322287 -2.023631
H  -1.502963 -2.780979 1.476832
H  -3.399792 2.425097 -0.608758
H  -2.934374 2.825051 1.05413
H  -0.57383 -3.127495 -1.328757
H  -0.177819 -4.16267 0.058536
H  2.831924 2.956499 0.367044
H  -3.637256 -1.854769 1.363802
H  -4.491712 -2.138755 -0.184987
H  4.109308 -1.911918 -0.090287
H  5.219794 2.238902 0.700197
H  5.857728 -0.169416 0.463523
H  -5.120945 -0.34069 -1.314503
