program: Gaussian 09
title: 000188860
version: EM64L-G09RevD.01
frameworkgroup: C1[X(C25H18O3)]
method: RPBEPBE
basis: SDD
operation: Freq
keyword: #pfreq=noraman
keyword: PBEPBE/SDD
title: #p freq=noraman PBEPBE/SDD
converged: YES YES NO NO
title: Mulliken charges:
elementType: O O O C C C C C C C C C C C C C C C C C C C C C C C C C H H H H H H H H H H H H H H H H H H
charge: -0.350447 -0.261578 -0.183650 0.145374 0.139151 0.504201 0.047412 0.511353 0.189520 0.189085 -0.833716 0.437941 0.408091 -0.502847 -0.502801 -0.485772 -0.489206 -0.356268 -0.363911 -0.603885 -0.450068 -0.393268 0.318103 -0.259755 -0.255707 0.285238 -0.763175 -0.535636 0.247472 0.244854 0.245122 0.241289 0.238065 0.275741 0.277647 0.263155 0.240114 0.240861 0.226242 0.229577 0.244857 0.254567 0.257388 0.221450 0.221090 0.246732
chargesum: 0.00000
title: Mulliken charges with hydrogens summed into heavy atoms:
elementType: O O O C C C C C C C C C C C C C C C C C C C C C C C C C
charge: -0.350447 -0.261578 -0.183650 0.145374 0.139151 0.504201 0.047412 0.511353 0.189520 0.189085 -0.586245 0.437941 0.408091 -0.257992 -0.257680 -0.244483 -0.251141 -0.080527 -0.086263 -0.340729 -0.209954 -0.152407 0.318103 -0.033513 -0.026130 0.285238 -0.006363 0.153635
polarizability: 5.41877544e+02 -6.50570539e+00 3.26510433e+02 -5.04069602e+00 2.41228365e+01 1.34480123e+02
1716.lowfreq: -74.1885 -8.9877 -2.5502 -0.0006 -0.0004 0.0002 4.9897 26.9933 30.7227
frequency: -74.1700 26.9669 30.7054 47.1953 60.3217 67.4982 80.2086 98.8639 104.0247 129.1978 157.8661 185.8504 206.6558 222.9265 228.2850 247.8923 266.7023 282.4108 306.7906 326.6573 357.1803 368.3625 387.1795 397.7119 422.3826 430.1115 470.7288 485.5303 507.0382 515.0661 524.1978 535.5026 538.7093 556.9487 560.1860 576.1775 578.6344 605.5759 615.0775 642.8615 677.6339 684.1188 701.7711 733.5050 736.9440 755.1261 762.9168 786.8377 794.0290 811.8168 813.5816 814.9021 834.1846 836.1196 861.5310 890.6935 897.8744 909.2021 928.4645 966.1522 968.3539 982.0821 982.4421 987.8598 989.0371 995.9560 999.1265 1005.6087 1016.2751 1041.3486 1051.3520 1111.1521 1112.0342 1121.0980 1143.9182 1148.3066 1160.1999 1172.1173 1177.8109 1184.3399 1205.1803 1232.6560 1238.9202 1245.5113 1262.1814 1285.0353 1294.5430 1308.1885 1365.0061 1367.6931 1380.7110 1387.3443 1397.0563 1405.3172 1419.0477 1422.9320 1434.0085 1442.9413 1451.9366 1455.4314 1457.2613 1467.2242 1472.3418 1481.2558 1486.4140 1513.8916 1547.3423 1559.4883 1601.9952 1618.4641 1619.2531 1632.4263 1637.4917 1686.5991 2961.0848 3008.1696 3049.5865 3098.2708 3120.4525 3121.9784 3122.9317 3125.2731 3125.5987 3133.4770 3133.8715 3146.8578 3148.3999 3152.9147 3154.4221 3157.8852 3201.6854 3205.1012
redmass: 1.0337 5.5641 7.4007 5.0388 4.7989 3.3584 3.6074 5.0041 4.3453 5.4613 4.5927 4.3358 4.3799 1.4208 3.1445 6.1387 4.6434 3.7728 3.8535 4.8343 8.5349 4.9434 4.8566 4.5397 3.3382 3.4008 5.4130 3.9552 5.1438 6.2337 5.1382 5.1558 3.4869 3.3989 3.9466 5.1604 4.0198 6.0660 4.1587 6.1224 4.3253 3.8334 5.3585 5.5511 3.9765 3.1732 1.4847 5.3951 2.3927 3.1791 2.1081 1.7300 1.9580 1.9760 5.3504 1.6389 1.6936 5.4052 1.7419 1.3726 1.3612 4.1870 1.6160 1.6771 1.7799 1.5432 3.3780 6.6391 3.8085 1.6193 2.1751 1.2591 2.3129 2.3828 1.5623 2.3043 1.3604 1.2359 1.1299 1.6682 1.3724 2.0893 1.7900 1.8108 2.9863 1.6115 2.8540 2.1331 5.0921 4.3746 1.2215 3.2897 6.0052 3.6632 2.6910 2.7447 1.3316 3.6239 1.0881 2.2418 1.0944 1.0506 1.1396 2.7474 3.1674 4.0156 6.4205 7.5670 6.1449 6.4462 6.7478 6.9748 7.0034 11.6097 1.0329 1.0360 1.1040 1.0974 1.0868 1.0870 1.0865 1.0895 1.0994 1.0914 1.1010 1.0990 1.0987 1.0920 1.0897 1.0989 1.0925 1.0926
irintensity: 0.6189 0.2614 0.1394 0.7883 0.7039 2.0650 3.0849 3.6911 3.5197 0.9069 1.1830 3.3384 0.6083 0.6448 2.3708 1.1264 1.2117 0.5737 2.7087 0.5654 2.3240 0.5116 0.4142 3.8264 3.2127 1.0418 0.9284 20.3427 5.2705 0.1834 13.8703 0.6410 1.7642 0.5182 2.0980 11.6428 3.6472 24.5457 2.1607 0.7301 5.3289 1.7821 6.5739 9.3576 30.4710 17.8441 28.4388 46.5278 8.0699 7.1265 15.6010 35.4541 0.4340 38.8763 7.4183 3.0551 14.5202 1.5712 85.5770 4.4557 7.1866 17.8511 5.5099 9.8783 7.3304 3.3903 17.6869 114.7459 45.5494 7.4976 6.2084 0.3148 38.9858 96.2598 45.4710 198.3630 18.6834 45.7317 3.0875 66.8306 20.5985 2.8849 41.9167 7.6624 192.9404 3.6830 30.2544 3.6018 6.1689 1.6424 59.5249 3.7504 3.7888 0.0355 0.6136 10.8150 18.6257 10.6233 11.5458 27.6473 25.1565 13.9625 57.4013 5.2557 56.5484 17.7214 33.4441 13.9750 27.8212 17.2536 38.0232 89.3181 34.0576 141.4181 85.1265 1.5430 47.6890 3.0186 0.6026 3.1633 0.4171 9.2383 31.9602 13.1826 11.0909 30.3165 35.7768 15.7932 11.5097 47.0728 5.8709 9.1228
temp: 298.150 k
press: 1.00000 atm
elementType: 8 8 8 6 6 6 6 6 6 6 6 6 6 6 6 6 6 6 6 6 6 6 6 6 6 6 6 6 1 1 1 1 1 1 1 1 1 1 1 1 1 1 1 1 1 1
symmnumber: 1
zpe: 931000.1 jmol-1
zpe.correction: 0.354599 hartree
zpe.thermalcorrener: 0.376553 hartree
zpe.thermalcorrenthalpy: 0.377497 hartree
zpe.thermalcorrgfe: 0.303047 hartree
zpe.sumelectzpe: -1187.259846 hartree
zpe.sumelectthermal: -1187.237892 hartree
zpe.sumelectthermalent: -1187.236948 hartree
zpe.sumelectthermalfe: -1187.311398 hartree
dipole: -0.7261 -2.5268 -1.6087
dipole: 3.0822
quadrupole: -137.4404 -129.1053 -175.2844
quadrupole: 11.7865 1.2056 4.2160
quadrupole: 9.8363 18.1714 -28.0077 11.7865 1.2056 4.2160
hfenergy: -1187.614445 hartree
pointgroup: C01 [X(C25H18O3)]
dipole: -0.2641415 -0.9929091 -0.6440656 debye
polarizability: 542.0819018|-2.3579325|325.8256469|-4.1380229|25.9775862|134.9605512 unknown
InChI: InChI=1S/C25H18O3/c1-15(26)28-25-23-18(9-7-16-5-3-4-6-21(16)23)13-19-10-8-17-14-20(27-2)11-12-22(17)24(19)25/h3-14H,1-2H3
charge 0 multiplicity 1
46 atoms
O  0.294357 -1.439347 0.007586
O  -6.201931 -0.808323 -0.353785
O  0.424418 -1.351204 2.354387
C  -0.686594 0.804379 -0.042989
C  1.820313 0.476226 -0.126605
C  -0.463531 2.23142 0.112106
C  0.480902 -0.015002 -0.072113
C  1.985449 1.909921 0.032804
C  -2.076611 0.320763 -0.141142
C  3.028822 -0.349929 -0.318531
C  0.850658 2.738069 0.165025
C  -3.160963 1.261971 0.056009
C  4.326856 0.278261 -0.196636
C  -1.585497 3.131818 0.275784
C  3.308433 2.488789 0.117184
C  -2.878611 2.665575 0.281012
C  4.434265 1.701705 0.040685
C  -2.448238 -1.01567 -0.484051
C  3.010417 -1.734331 -0.686508
C  -4.512758 0.833789 -0.016053
C  5.51703 -0.493498 -0.358296
C  -3.787282 -1.428251 -0.571973
C  -4.834424 -0.500136 -0.313657
C  4.193839 -2.468922 -0.860227
C  5.462025 -1.856063 -0.674523
C  0.284795 -2.017333 1.317354
C  0.090621 -3.513423 1.21846
C  -6.579842 -2.18549 -0.680509
H  0.996936 3.813216 0.324478
H  -1.372924 4.198024 0.414578
H  3.388212 3.572162 0.262313
H  -3.722331 3.349374 0.427212
H  5.434414 2.141414 0.128741
H  -1.668985 -1.741006 -0.717318
H  2.054409 -2.22474 -0.867969
H  -5.32503 1.550357 0.143277
H  6.484898 0.009666 -0.245791
H  -4.007476 -2.463391 -0.849536
H  4.134818 -3.523976 -1.150352
H  6.382233 -2.437054 -0.798278
H  -0.016138 -3.842843 0.174886
H  -0.806216 -3.800592 1.794238
H  0.955609 -4.020252 1.680493
H  -6.175536 -2.901751 0.060864
H  -6.238449 -2.4680 -1.69531
H  -7.67896 -2.196473 -0.644022
