program: Gaussian 09
title: 000188857
version: EM64L-G09RevD.01
frameworkgroup: C1[X(C7H3Cl3O3)]
method: RPBEPBE
basis: SDD
operation: Freq
keyword: #p
keyword: freq=noraman
keyword: PBEPBE/SDD
title: #p freq=noraman PBEPBE/SDD
converged: NO YES NO YES
title: Mulliken charges:
elementType: Cl Cl Cl O O O C C C C C C C H H H
charge: 0.005013 0.010122 0.060063 -0.352172 -0.455874 -0.203448 0.190623 0.252720 -0.273070 -0.246760 -0.104491 -0.078208 0.125141 0.315294 0.363679 0.391369
chargesum: 0.00000
title: Mulliken charges with hydrogens summed into heavy atoms:
elementType: Cl Cl Cl O O O C C C C C C C
charge: 0.005013 0.010122 0.060063 0.011507 -0.064505 -0.203448 0.190623 0.252720 0.042225 -0.246760 -0.104491 -0.078208 0.125141
polarizability: 1.67969849e+02 -2.25243533e+00 1.45524970e+02 -3.12701570e-03 4.73735424e-04 4.18327476e+01
1716.lowfreq: -0.0017 -0.0016 -0.0008 0.1497 5.6245 5.8249 31.9281 64.6953 93.9470
frequency: 31.9158 64.6840 93.9469 134.5230 158.2782 192.4184 200.8682 260.3974 297.5322 308.5957 336.2266 342.3811 364.1032 409.0248 480.9345 490.6229 524.3241 577.1039 586.0047 609.4458 647.9736 694.6321 721.6466 761.3112 790.0823 896.4240 920.7093 999.2191 1128.1352 1155.6351 1188.5234 1290.2487 1299.2634 1352.7291 1381.8733 1430.6420 1563.0416 1582.6144 1656.2460 3196.5231 3458.0169 3536.5886
redmass: 12.9593 15.1768 14.4392 8.0098 11.4639 25.9223 31.6237 7.5397 15.2395 9.1893 8.5067 23.5536 8.8945 12.2975 1.1084 3.7395 8.1304 1.8260 4.8871 2.7422 6.9009 8.7401 10.7616 6.3085 7.3693 10.4877 1.4463 5.0542 2.9087 1.4165 2.9736 2.1493 2.3433 7.1190 8.1557 4.8023 8.3104 7.6026 9.2525 1.0925 1.0646 1.0643
irintensity: 1.2320 0.0070 0.0281 0.2779 0.4320 0.0968 0.0006 0.0051 0.2394 7.0476 1.9293 0.3463 5.4986 1.2046 141.2179 10.3786 50.2730 65.5043 28.6053 85.5434 39.6539 10.5888 88.8987 17.7634 18.2636 10.4254 14.4530 274.8098 164.5174 102.8947 41.8299 30.2302 111.3705 142.9424 14.2730 107.8158 22.6010 55.0821 304.9405 8.9023 73.2793 56.4154
temp: 298.150 k
press: 1.00000 atm
elementType: 17 17 17 8 8 8 6 6 6 6 6 6 6 1 1 1
symmnumber: 1
zpe: 227980.8 jmol-1
zpe.correction: 0.086833 hartree
zpe.thermalcorrener: 0.099176 hartree
zpe.thermalcorrenthalpy: 0.100120 hartree
zpe.thermalcorrgfe: 0.046515 hartree
zpe.sumelectzpe: -1873.453604 hartree
zpe.sumelectthermal: -1873.441262 hartree
zpe.sumelectthermalent: -1873.440317 hartree
zpe.sumelectthermalfe: -1873.493922 hartree
dipole: 0.1005 -0.0740 0.0008
dipole: 0.1248
quadrupole: -98.1595 -88.4360 -94.9019
quadrupole: 10.7159 -0.0005 0.0064
quadrupole: -4.3270 5.3965 -1.0695 10.7159 -0.0005 0.0064
hfenergy: -1873.5404373 hartree
pointgroup: C01 [X(C7H3Cl3O3)]
dipole: 0.0392071 0.0295335 -0.0011357 debye
dipolederiv: -0.1833038 0.1857215 0.0057975 0.2005274 -0.5706586 -0.0088063 0.0058158 -0.0083835 -0.0024082 -0.2226273 -0.2785474 0.0034218 -0.302924 -0.5454877 0.0042906 0.0032084 0.003607 -0.017812 -0.712786 0.0169237 0.0184484 0.0560081 -0.0015342 -0.001522 0.0185687 -0.0005236 0.0143672 -0.3380443 -0.5178451 -0.0040257 -0.4107179 -1.0939304 0.00552 -0.0031871 0.0083017 -0.3519387 -0.610387 0.4088308 0.0070795 0.5648814 -1.1063163 -0.0188745 0.0081941 -0.015009 -0.4369589 -1.0394096 -0.2487831 0.0172391 -0.1443011 -0.6285286 0.0015522 0.018094 0.0043721 -0.3044525 -0.8004521 0.2574124 0.0215991 -0.1720055 -0.0997671 0.0038446 0.0187145 -0.0071895 -0.0238284 0.3800605 0.6560943 -0.0019522 0.3495604 0.7839709 -0.0043686 -0.0039788 -0.012108 0.1281196 0.2510314 -0.259707 -0.0091681 0.2067587 -0.2071204 -0.0063511 -0.0061457 0.0055133 -0.042028 -0.1769499 -0.732642 -0.0024553 -0.3429834 0.6131049 0.0131451 0.0001571 0.0230184 -0.0807991 -0.1688413 0.6701324 0.006552 0.6220985 0.6691182 -0.0110066 0.0062111 -0.01214 -0.0800786 1.002713 0.002904 -0.024814 -0.2615289 0.0422881 0.0068969 -0.0263744 0.0001372 0.0127679 2.0103202 -0.2525443 -0.0470427 -0.3133315 1.360337 0.0153597 -0.0476506 0.0138053 0.2451336 0.1518507 0.0145698 0.0004699 0.0065555 0.0819447 -0.0007301 0.0004747 -0.000907 0.1669347 0.2863636 0.1473733 0.003255 0.0992843 0.3785917 -0.0024893 0.0028699 -0.0037714 0.3692355 0.1704619 -0.0698932 0.0055957 -0.1578821 0.3239877 0.0035394 0.0050283 0.0012769 0.4037458 unknown
polarizability: 167.8387892|2.5058425|145.5706733|-3.1925919|0.6170589|41.9181043 unknown
InChI: InChI=1S/C7H3Cl3O3/c8-3-1-2(7(12)13)6(11)5(10)4(3)9/h1,11-12H
charge 0 multiplicity 1
16 atoms
Cl 1.818653 -2.760704 -0.040281
Cl 2.120758 2.846576 -0.01153
Cl 3.618383 -0.05306 -0.067815
O  -1.139887 -2.226333 0.038051
O  -2.896377 1.684996 0.10943
O  -3.358786 -0.589565 0.106512
C  -1.024485 0.201154 0.051353
C  -0.381291 -1.073486 0.026456
C  -0.226783 1.373589 0.038679
C  1.042497 -1.116007 -0.010047
C  1.172037 1.308358 0.002525
C  1.826426 0.053039 -0.022241
C  -2.508322 0.325313 0.090386
H  -0.729229 2.342387 0.057941
H  -0.55044 -3.030197 0.017228
H  -3.889653 1.723036 0.135452
