program: Gaussian 09
title: 000188852
version: EM64L-G09RevD.01
frameworkgroup: C1[X(C11H9NO3)]
method: RPBEPBE
basis: SDD
operation: Freq
keyword: #p
keyword: freq=noraman
keyword: PBEPBE/SDD
title: #p freq=noraman PBEPBE/SDD
converged: YES YES NO NO
title: Mulliken charges:
elementType: O O O N C C C C C C C C C C C H H H H H H H H H
charge: -0.388813 -0.195954 -0.168675 0.012029 0.287930 0.457228 0.430480 0.107464 -0.002472 -0.723052 -0.337278 -0.437716 -0.808821 -0.266846 -0.235363 0.250412 0.192206 0.250793 0.270075 0.225090 0.240136 0.236712 0.236300 0.368136
chargesum: 0.00000
title: Mulliken charges with hydrogens summed into heavy atoms:
elementType: O O O N C C C C C C C C C C C
charge: -0.020677 -0.195954 -0.168675 0.012029 0.287930 0.457228 0.430480 0.107464 -0.002472 -0.472640 -0.145072 -0.186923 -0.073520 -0.030134 0.000937
polarizability: 2.22637931e+02 7.95390506e+00 1.47211137e+02 -8.97274928e-01 -2.94637099e+00 6.84927602e+01
1716.lowfreq: -12.2758 -0.0009 -0.0008 -0.0007 4.5674 8.0107 60.4073 68.1289 91.9978
frequency: 60.4040 68.1261 91.9965 150.6435 158.0266 185.7922 208.6546 229.2757 270.4235 288.9709 295.1496 337.3242 411.4846 431.5615 460.1804 510.4176 525.6245 564.9550 574.4616 596.7091 633.9763 661.3016 714.9501 738.9561 749.2270 783.1329 841.5244 844.4313 870.8959 891.7998 953.2217 992.0277 1000.1548 1030.3747 1044.3662 1052.0555 1081.1570 1151.9276 1157.4680 1184.7435 1225.9559 1237.2841 1259.6144 1305.8830 1338.0713 1375.0395 1404.6424 1417.0785 1423.1218 1442.3494 1452.9668 1462.4811 1477.3254 1511.2356 1585.4589 1606.4055 1641.5629 2990.5195 3072.9817 3094.7499 3102.9218 3131.4041 3139.9086 3148.8987 3168.3476 3595.5821
redmass: 8.7451 7.8642 2.9760 2.1929 1.7600 2.8313 1.7630 3.5309 3.3900 6.3637 3.4945 5.5726 4.2164 5.7392 3.6397 4.0000 7.0163 4.4170 3.6405 6.6662 5.8617 6.1953 6.0963 8.6622 1.3368 3.2696 4.5894 1.3479 5.3724 1.6501 1.4071 1.3536 2.4146 2.5017 2.3556 1.5454 4.0214 1.8774 1.4286 1.1542 1.5907 3.9345 2.1632 2.4427 4.3167 7.3010 1.2458 2.7829 4.5795 3.0335 4.4769 1.0653 1.1924 3.0442 7.0369 6.0630 6.9589 1.0378 1.0962 1.0884 1.1002 1.0875 1.0917 1.0934 1.1000 1.0659
irintensity: 3.5440 0.0114 3.2958 13.1530 0.7080 2.0110 61.3386 31.1804 0.9561 4.1271 2.9300 5.3945 11.4475 2.5141 12.1887 5.9288 5.1599 5.1353 17.9570 6.1234 5.1840 0.2934 2.5204 16.3935 74.9815 6.0097 28.3976 7.1794 14.9561 25.3350 4.1542 0.5888 6.7400 10.3183 45.4110 8.9327 27.9212 49.6184 59.7150 7.3698 33.9056 184.7542 25.4606 14.9827 40.0486 170.0601 14.4041 26.7971 16.4165 10.2479 13.0259 10.1016 25.6622 23.2365 8.7972 23.0228 45.7339 17.2560 9.2812 16.6636 12.8159 0.4165 6.9621 21.7575 24.9762 36.4158
temp: 298.150 k
press: 1.00000 atm
elementType: 8 8 8 7 6 6 6 6 6 6 6 6 6 6 6 1 1 1 1 1 1 1 1 1
symmnumber: 1
zpe: 463012.6 jmol-1
zpe.correction: 0.176352 hartree
zpe.thermalcorrener: 0.189262 hartree
zpe.thermalcorrenthalpy: 0.190206 hartree
zpe.thermalcorrgfe: 0.137044 hartree
zpe.sumelectzpe: -703.854729 hartree
zpe.sumelectthermal: -703.841819 hartree
zpe.sumelectthermalent: -703.840875 hartree
zpe.sumelectthermalfe: -703.894036 hartree
dipole: -6.0609 1.3690 0.1014
dipole: 6.2145
quadrupole: -90.3627 -73.0510 -92.7809
quadrupole: 10.3887 1.2287 2.6399
quadrupole: -4.9645 12.3472 -7.3827 10.3887 1.2287 2.6399
hfenergy: -704.0310808 hartree
pointgroup: C01 [X(C11H9N1O3)]
dipole: 2.3916705 0.504833 -0.0534931 debye
dipolederiv: -0.1097392 -0.1976516 0.0075412 -0.1641272 -1.2507834 0.0878595 0.0190433 0.1111672 -0.3589451 -0.8110037 0.0766221 0.2390499 0.0418056 -0.3356919 -0.1539546 0.1534189 -0.2079164 -0.5606216 -0.6296508 -0.1764828 -0.1047619 -0.2819517 -0.3570212 -0.2550181 -0.0462394 -0.2295795 -0.5401934 1.5294553 0.1554648 -0.1517577 0.3706369 0.4285772 0.4852571 -0.1071958 0.4641318 0.9358619 -0.0333758 -0.2976992 0.0217836 0.0846967 -0.2573721 0.0177993 0.0143969 0.023465 -0.0094375 0.3145178 -0.1288061 0.0071692 -0.2633158 0.0407296 0.0011675 0.0119333 0.0018617 0.0969856 0.3846974 -0.2130481 0.0114641 0.1219393 0.2906289 -0.0240822 0.1483628 0.0168283 0.00836 -0.4013403 0.1940578 -0.0115022 -0.0981837 -0.1584165 -0.0425692 -0.0205246 -0.0366839 -0.1006761 0.2564277 0.1936707 -0.0029347 0.0207757 1.1283791 -0.1096442 -0.1665582 -0.1147398 0.0959239 -0.4942269 0.1785562 -0.0108883 0.0337068 -0.0114711 -0.0077969 0.0063853 -0.0141427 -0.2196185 -0.0479525 0.0751595 -0.0065017 -0.0666614 0.0622105 -0.0120806 0.0127857 -0.0045063 -0.1585094 -0.1751705 0.0845635 -0.0064835 0.1181636 0.1146007 -0.0130845 -0.0043728 -0.0152509 -0.1651964 -0.1556845 0.1328954 0.0002638 0.0733664 0.0123168 -0.0147948 0.0381921 -0.0325584 0.029503 -0.0217525 -0.134061 0.0090526 -0.0622378 0.0084708 -0.0084487 -0.0011093 -0.0121292 -0.1541158 0.0953691 0.0883879 -0.0061199 0.0193542 0.0452984 -0.0119701 -0.0003384 -0.0093368 -0.1502378 0.0543862 -0.0427183 0.0018027 -0.0094603 -0.0789417 0.0133745 -0.0222693 0.015684 0.1557195 0.0669011 -0.0964308 0.0044189 -0.0245751 -0.1355772 0.0179461 0.0001785 0.0171375 0.1524025 0.0757864 0.0093422 0.0005443 -0.0611501 -0.0866118 0.0134668 0.0033486 0.0117897 0.1550664 0.0352332 0.0413337 0.065589 0.02787 0.1083682 0.0449434 0.0771902 -0.0102131 -0.0026145 0.0594513 -0.1328153 0.0101429 -0.0112431 -0.1055767 0.0259059 -0.0073233 0.0423593 0.1130785 -0.0015337 0.0184187 -0.0864506 -0.0026423 0.0611205 -0.0650109 -0.1208093 -0.0149161 -0.0121234 -0.0348049 0.0953237 -0.0051596 0.108019 0.002423 0.0090199 -0.0065041 0.0079385 0.1639543 -0.1044103 -0.0621138 0.0040836 -0.0657649 0.0725529 0.0051892 0.004636 0.0052713 0.1628121 0.14842 0.138031 0.0096541 0.0909794 0.4017869 -0.0034745 0.0133731 -0.0156613 0.3626219 unknown
polarizability: 222.3902827|-9.0037289|147.4848613|-1.4566069|2.4738993|68.4666844 unknown
InChI: InChI=1S/C11H9NO3/c1-7-6-8-4-2-3-5-9(8)11(13)10(7)12(14)15/h2-6,13H,1H3
charge 0 multiplicity 1
24 atoms
O  -0.657163 -2.305908 0.182564
O  -3.491602 -0.074437 0.990077
O  -3.100583 -1.288946 -0.901367
N  -2.721878 -0.499898 0.041868
C  1.085122 -0.534834 0.059766
C  1.349532 0.885563 -0.014998
C  -1.07396 1.3957 -0.020563
C  -1.321173 -0.01808 0.032846
C  -0.289869 -0.967706 0.075354
C  0.258904 1.813309 -0.054416
C  2.187578 -1.449509 0.111422
C  2.712186 1.329759 -0.043896
C  -2.212143 2.394892 -0.064246
C  3.504478 -0.984762 0.080999
C  3.768813 0.418316 0.002106
H  0.481357 2.884141 -0.11656
H  2.024147 -2.534058 0.175384
H  2.91154 2.405849 -0.102169
H  -2.798985 2.367408 0.870227
H  -1.822103 3.415187 -0.209557
H  -2.917303 2.175744 -0.887487
H  4.33761 -1.693898 0.119394
H  4.804597 0.772848 -0.020117
H  0.127099 -2.907082 0.172868
