program: Gaussian 09
title: 000188843
version: EM64L-G09RevD.01
frameworkgroup: C1[X(C8H13NO5)]
method: RPBEPBE
basis: SDD
operation: Freq
keyword: #p
keyword: freq=noraman
keyword: PBEPBE/SDD
title: #p freq=noraman PBEPBE/SDD
converged: YES YES NO NO
title: Mulliken charges:
elementType: O O O O O N C C C C C C C C H H H H H H H H H H H H H
charge: -0.257344 -0.252340 -0.265029 -0.216786 -0.222379 -0.022983 -0.378256 -0.390750 0.209882 0.291522 -0.757045 -0.736584 0.276827 -0.500289 0.245693 0.261400 0.271408 0.267720 0.228565 0.249232 0.232800 0.248780 0.265975 0.219166 0.244734 0.237512 0.248569
chargesum: 0.00000
title: Mulliken charges with hydrogens summed into heavy atoms:
elementType: O O O O O N C C C C C C C C
charge: -0.257344 -0.252340 -0.265029 -0.216786 -0.222379 -0.022983 0.128837 0.148378 0.209882 0.291522 -0.046448 -0.002664 0.276827 0.230526
polarizability: 1.53671119e+02 2.98888808e+00 9.50704836e+01 -9.40313435e+00 1.37950756e+00 9.37999939e+01
1716.lowfreq: -10.4878 -2.9902 -0.0009 -0.0006 -0.0005 4.0870 17.7920 25.8742 36.8397
frequency: 17.6566 25.8499 36.7972 41.5558 56.1652 79.2145 85.8434 91.1093 153.2773 179.3441 183.9777 206.1477 214.5588 260.2110 290.6683 308.5996 318.8542 361.4264 416.4107 477.8221 492.6893 532.7260 536.0651 574.3122 652.2025 667.0675 812.0170 832.1110 840.8562 841.4324 931.0504 957.7898 971.4885 989.3195 997.7896 1017.7122 1048.4664 1064.7980 1084.3863 1106.4583 1115.2161 1150.6746 1155.9768 1228.5792 1231.4830 1283.6863 1333.3128 1346.4046 1382.6923 1393.0830 1413.5506 1421.9432 1425.8521 1451.4978 1453.9469 1454.0315 1461.3081 1464.1771 1467.5849 1613.4945 1667.1399 1687.5157 2976.0966 2989.3438 3008.2654 3016.7136 3028.2856 3054.5382 3071.1946 3086.2230 3107.7066 3111.4856 3112.2010 3118.0686 3154.9146
redmass: 4.1934 4.6360 3.2207 5.3861 5.3091 2.8031 1.0791 1.4520 3.8488 2.8777 1.4736 3.7471 2.4664 2.9325 3.6160 5.2084 4.7160 3.2513 3.4089 3.8511 3.5954 3.0860 3.9737 4.6195 6.2426 5.7515 5.0254 5.8843 4.1471 5.9199 7.3744 1.2598 1.3816 3.7879 2.5361 3.0340 4.9459 1.9830 1.6637 4.2434 1.2626 1.4374 5.0121 1.1259 1.1369 3.8902 1.3669 1.4543 1.2314 1.2345 1.0796 1.1347 1.1261 1.1091 1.0514 1.0496 1.0489 1.0506 1.0705 6.1712 9.6510 10.4486 1.0369 1.0364 1.0295 1.0571 1.0609 1.0976 1.0960 1.1037 1.1004 1.0995 1.1050 1.1013 1.1051
irintensity: 0.6189 1.3143 2.9523 0.6654 1.4434 1.4562 0.9358 0.8073 8.9967 4.3265 0.9335 6.2819 0.5476 9.9778 8.0996 10.9358 20.5982 1.3123 28.6520 2.0511 1.9961 2.4748 6.5317 3.2801 21.1597 21.7081 96.5403 3.5020 31.4385 4.2433 9.9627 0.2009 7.0367 11.7454 53.4220 10.0398 265.2108 164.6845 5.1471 297.3150 0.4342 13.4311 146.9570 8.5328 5.0937 10.8767 13.0577 28.5993 47.7001 10.9175 34.2465 37.5769 14.8599 20.6396 13.8179 17.1469 14.5632 12.6271 4.6203 6.6249 160.5193 141.1774 22.9012 16.7632 30.6221 29.7209 14.9489 18.1166 10.1471 3.7018 8.5637 26.8906 23.3936 1.9103 14.5387
temp: 298.150 k
press: 1.00000 atm
elementType: 8 8 8 8 8 7 6 6 6 6 6 6 6 6 1 1 1 1 1 1 1 1 1 1 1 1 1
symmnumber: 1
zpe: 545463.7 jmol-1
zpe.correction: 0.207756 hartree
zpe.thermalcorrener: 0.224607 hartree
zpe.thermalcorrenthalpy: 0.225551 hartree
zpe.thermalcorrgfe: 0.159564 hartree
zpe.sumelectzpe: -742.357379 hartree
zpe.sumelectthermal: -742.340528 hartree
zpe.sumelectthermalent: -742.339584 hartree
zpe.sumelectthermalfe: -742.405571 hartree
dipole: -0.9535 -0.8220 -0.6365
dipole: 1.4107
quadrupole: -51.2732 -82.0055 -81.9533
quadrupole: 1.3315 0.2558 -0.9355
quadrupole: 20.4708 -10.2615 -10.2093 1.3315 0.2558 -0.9355
hfenergy: -742.5651355 hartree
pointgroup: C01 [X(C8H13N1O5)]
dipole: 0.3595269 -0.1849161 -0.3802433 debye
polarizability: 153.9980035|8.3977962|92.8500245|-2.6634522|0.7596926|95.6935684 unknown
InChI: InChI=1S/C8H13NO5/c1-6(2)9-14-5-8(11)13-4-7(10)12-3/h4-5H2,1-3H3
charge 0 multiplicity 1
27 atoms
O  1.045371 1.161544 -0.838426
O  -2.195292 0.914729 0.876189
O  4.265938 -0.565181 -0.645818
O  -0.070074 -0.76339 -0.109314
O  2.960396 0.353391 1.060371
N  -3.034672 0.59353 -0.313167
C  -0.968092 1.511119 0.383139
C  2.161737 0.326897 -1.292465
C  -4.06497 -0.137329 0.051549
C  -0.00205 0.474836 -0.18591
C  -5.025827 -0.509389 -1.055904
C  -4.325236 -0.612442 1.463977
C  3.133206 0.06639 -0.139796
C  5.304751 -0.923979 0.353617
H  -1.170821 2.280286 -0.383186
H  -0.489435 1.986669 1.257938
H  1.79589 -0.641323 -1.679813
H  2.660896 0.888491 -2.096136
H  -6.04266 -0.136327 -0.827854
H  -4.698102 -0.087702 -2.01962
H  -5.094524 -1.609776 -1.15092
H  -4.517588 0.24528 2.135262
H  -3.430695 -1.123473 1.863438
H  -5.189115 -1.295505 1.497856
H  5.688194 -0.0140 0.844375
H  6.091039 -1.424253 -0.22779
H  4.879637 -1.598495 1.115206
