program: Gaussian 09
title: 000188840
version: EM64L-G09RevD.01
frameworkgroup: C1[X(C20H20O5)]
method: RPBEPBE
basis: SDD
operation: Freq
keyword: #pfreq=noraman
keyword: PBEPBE/SDD
title: #p freq=noraman PBEPBE/SDD
converged: NO YES NO NO
title: Mulliken charges:
elementType: O O O O O C C C C C C C C C C C C C C C C C C C C H H H H H H H H H H H H H H H H H H H H
charge: -0.223285 -0.206809 -0.200065 -0.208663 -0.203238 0.378360 0.204588 -0.335817 -0.269885 -0.501038 -0.502226 -0.585378 -0.428215 0.238956 -0.816830 -0.138924 -0.173059 0.172298 -0.413352 0.083504 -0.300383 0.332948 -0.352487 -0.344755 -0.174963 0.243255 0.281014 0.233457 0.274421 0.248211 0.206644 0.255154 0.231520 0.229868 0.225210 0.239042 0.220786 0.241053 0.249870 0.254650 0.268240 0.236208 0.285477 0.276848 0.267791
chargesum: 0.00000
title: Mulliken charges with hydrogens summed into heavy atoms:
elementType: O O O O O C C C C C C C C C C C C C C C C C C C C
charge: -0.223285 -0.206809 -0.200065 -0.208663 -0.203238 0.378360 0.204588 -0.092562 0.011129 0.006840 -0.047372 -0.098704 0.026862 0.238956 -0.115949 0.110946 0.081590 0.172298 -0.145112 0.083504 -0.064175 0.332948 -0.067010 -0.067908 0.092829
polarizability: 2.73923944e+02 -9.11608269e+00 2.00706527e+02 -1.00801572e+00 -1.53603403e+00 1.66488729e+02
1716.lowfreq: -11.2667 -0.0006 -0.0005 0.0001 3.4583 12.9074 36.0306 46.7250 58.9311
frequency: 35.9106 46.7185 58.8929 76.4473 84.3900 115.2171 123.2030 171.6339 184.0509 190.8113 213.8066 224.3106 241.4154 260.3212 275.4533 299.1346 309.7803 326.7940 343.3027 369.6318 375.8880 405.1851 426.7272 441.6049 448.5827 484.7654 515.4695 520.7910 536.8297 562.0730 573.9940 584.8296 588.6958 604.8839 618.7155 657.0372 664.1694 691.5518 719.6684 726.3088 746.0631 751.8926 768.6628 781.8372 806.5652 825.0665 850.4874 857.3228 868.8204 884.7522 896.1803 920.1629 927.1465 931.3064 935.7846 948.7258 954.2669 968.4527 970.7375 979.1078 983.8987 987.6524 1005.5340 1020.0739 1047.1625 1048.7187 1055.4726 1063.1717 1082.6793 1108.6903 1120.4263 1134.4001 1138.8975 1146.5587 1168.8420 1177.6400 1197.7791 1206.4605 1218.3069 1220.5929 1230.0842 1239.0532 1249.1813 1258.0600 1287.3727 1291.2548 1300.8871 1303.5020 1307.3013 1324.5629 1338.9976 1344.0322 1349.2390 1353.5658 1374.0065 1393.6835 1398.9041 1462.1946 1463.4555 1470.7690 1477.8392 1479.4537 1494.4473 1501.6798 1575.0926 1585.3728 1663.3862 1665.2307 1685.3723 2882.6454 2967.5692 2984.5587 3002.2734 3003.4979 3008.7103 3011.8026 3028.1248 3058.0473 3061.2860 3069.2961 3071.9929 3099.9087 3109.7155 3132.2457 3145.1489 3162.6916 3229.6079 3252.6439 3273.2428
redmass: 5.6514 5.8674 4.8672 7.1059 8.7793 6.8360 6.1891 5.1249 4.2089 3.8351 4.5151 3.6103 3.7799 1.3166 2.9709 3.5504 5.1138 2.5491 2.6748 4.8696 3.9359 2.5885 3.8430 3.5019 4.2874 3.8101 3.4838 4.7619 4.1451 5.6176 4.2743 3.9554 3.9720 5.7909 3.9295 2.4925 4.9910 3.1341 3.9333 1.4841 1.8806 2.3771 2.0388 2.4323 3.9494 3.3804 5.5832 3.6603 2.9445 1.3507 2.4428 2.6586 1.5946 3.0977 4.3433 2.5350 3.0197 1.6543 2.1105 2.5331 2.1126 2.8589 2.5604 2.5104 2.4583 2.4962 3.1567 2.2126 1.7216 2.5175 2.0801 2.5842 2.0620 2.5169 2.0980 1.5139 1.7086 1.3348 1.2756 1.4032 1.3934 1.5105 1.4312 1.4861 1.9229 1.5550 1.5582 1.5607 1.4724 1.3875 1.3767 1.5570 1.4754 1.4715 3.1706 1.2257 1.5818 1.0713 1.0830 1.0807 4.1273 1.0869 1.0734 1.0629 5.9624 8.5748 7.5388 11.6341 12.4201 1.0805 1.0802 1.0393 1.0630 1.0617 1.0638 1.0639 1.0828 1.0985 1.1006 1.0986 1.1017 1.1028 1.0948 1.0852 1.0920 1.0994 1.0933 1.0988 1.1082
irintensity: 0.3668 0.9201 0.8857 3.1059 3.4900 2.5745 0.8324 1.3180 2.5534 0.7577 0.6764 1.7933 1.5638 0.1931 4.8658 1.0005 2.7972 0.7902 2.7314 1.3009 9.8601 1.7663 0.0542 0.2987 0.2340 4.0315 2.8586 5.7617 1.2691 0.6465 0.4591 11.2653 5.7790 3.1222 5.1495 24.7991 2.5470 13.3293 6.9728 3.9008 27.6952 56.7519 33.1668 37.9554 5.7601 6.9194 34.1883 4.6827 21.5132 8.5654 25.2055 1.5850 31.7811 44.8884 97.5050 13.8399 22.3186 11.9100 7.8365 21.0310 56.0997 7.3064 5.0969 49.1784 25.7604 52.0920 32.5999 29.8185 3.1349 7.5731 14.7693 5.2764 28.3108 9.4387 20.7715 24.3715 24.2340 6.3170 5.4391 20.6524 11.6222 4.8825 1.9769 3.4838 45.0639 3.1157 11.5451 33.6044 2.0295 10.7998 0.0515 0.5578 9.9309 2.8541 0.8839 11.1457 14.5071 8.8796 12.5302 4.5458 21.7675 21.0918 5.7283 6.0404 1.5417 34.6422 7.5467 211.6393 456.5170 24.5898 9.2132 16.4233 13.0731 53.8847 26.1002 13.8395 27.3516 11.3806 18.0227 28.5443 11.7526 20.9296 28.1607 1.9248 3.7385 15.0438 1.5501 1.1405 0.0169
temp: 298.150 k
press: 1.00000 atm
elementType: 8 8 8 8 8 6 6 6 6 6 6 6 6 6 6 6 6 6 6 6 6 6 6 6 6 1 1 1 1 1 1 1 1 1 1 1 1 1 1 1 1 1 1 1 1
symmnumber: 1
zpe: 940434.0 jmol-1
zpe.correction: 0.358192 hartree
zpe.thermalcorrener: 0.378523 hartree
zpe.thermalcorrenthalpy: 0.379467 hartree
zpe.thermalcorrgfe: 0.310254 hartree
zpe.sumelectzpe: -1148.377177 hartree
zpe.sumelectthermal: -1148.356846 hartree
zpe.sumelectthermalent: -1148.355902 hartree
zpe.sumelectthermalfe: -1148.425115 hartree
dipole: 6.4827 -1.4999 -3.4964
dipole: 7.5166
quadrupole: -183.6022 -150.4424 -141.8690
quadrupole: -10.2995 5.2914 -5.5619
quadrupole: -24.9643 8.1955 16.7689 -10.2995 5.2914 -5.5619
hfenergy: -1148.7353692 hartree
pointgroup: C01 [X(C20H20O5)]
dipole: -2.5194024 -0.4657202 1.4768747 debye
polarizability: 273.5333404|10.0240733|200.8931525|-3.7985045|-2.6517741|166.6927072 unknown
InChI: InChI=1S/C20H20O5/c1-19-9-15(12-6-8-23-10-12)25-18(22)13(19)5-7-20-11-24-17(21)14(20)3-2-4-16(19)20/h2-4,6,8,10,13,15-16H,5,7,9,11H2,1H3
charge 0 multiplicity 1
45 atoms
O  -2.038887 1.734382 -0.089177
O  4.122462 -1.901208 -0.199428
O  -0.850683 1.797264 -2.035705
O  5.849907 -0.321711 -0.200935
O  -5.222774 -1.683256 0.34932
C  -0.346285 -0.526777 0.749356
C  2.169168 -0.438078 -0.044617
C  1.095642 0.083639 0.96253
C  -0.786314 -0.321756 -0.750553
C  1.676558 -0.224097 -1.514935
C  0.274004 -0.820756 -1.763347
C  -1.369371 0.156674 1.731948
C  2.673785 -1.900211 0.167485
C  3.481982 0.32041 0.157248
C  -0.355579 -2.049155 1.066484
C  1.115417 1.621505 0.939555
C  -2.546127 0.875522 1.032708
C  -1.189205 1.127515 -1.042714
C  3.531545 1.641901 0.497835
C  4.635726 -0.571106 -0.087906
C  2.268608 2.335562 0.753854
C  -3.666148 -0.014618 0.534373
C  -4.592813 0.32615 -0.533441
C  -4.086214 -1.233948 1.043691
C  -5.509482 -0.703117 -0.619704
H  1.41418 -0.219822 1.990136
H  -1.712074 -0.91812 -0.892534
H  2.407689 -0.67928 -2.209197
H  1.652377 0.857886 -1.734894
H  -0.051938 -0.545424 -2.782123
H  0.311504 -1.926059 -1.728384
H  -0.85219 0.889883 2.37447
H  -1.790263 -0.599041 2.419569
H  2.595363 -2.218524 1.223959
H  2.20394 -2.646322 -0.490835
H  0.270051 -2.642775 0.38295
H  -0.003695 -2.235589 2.098537
H  -1.385197 -2.442102 0.98296
H  0.185852 2.16765 1.132913
H  -2.973047 1.634232 1.713599
H  4.494088 2.159613 0.579918
H  2.255601 3.429251 0.810838
H  -4.553362 1.223262 -1.148046
H  -3.752382 -1.881755 1.848901
H  -6.367914 -0.906692 -1.25266
