program: Gaussian 09
title: 000188803
version: EM64L-G09RevD.01
frameworkgroup: C1[X(C11H16N2O8)]
method: RPBEPBE
basis: SDD
operation: Freq
keyword: #p
keyword: freq=noraman
keyword: PBEPBE/SDD
title: #p freq=noraman PBEPBE/SDD
converged: YES YES NO NO
title: Mulliken charges:
elementType: O O O O O O O O N N C C C C C C C C C C C H H H H H H H H H H H H H H H H
charge: -0.271769 -0.410989 -0.217408 -0.401016 -0.409538 -0.265305 -0.253848 -0.342368 -0.371645 -0.387944 -0.179033 -0.400061 -0.233152 0.246531 -0.546266 -0.473950 0.146428 0.211904 0.193531 0.305879 -0.786699 0.305813 0.264713 0.244315 0.299350 0.370863 0.300908 0.264419 0.253111 0.274695 0.357699 0.224282 0.250212 0.288677 0.385909 0.384045 0.377708
chargesum: 0.00000
title: Mulliken charges with hydrogens summed into heavy atoms:
elementType: O O O O O O O O N N C C C C C C C C C C C
charge: -0.271769 -0.025080 -0.217408 -0.016971 -0.031830 -0.265305 -0.253848 -0.342368 -0.000782 -0.030245 0.126780 0.108967 0.066198 0.246531 0.019061 0.053855 0.146428 0.211904 0.193531 0.305879 -0.023529
polarizability: 1.95396741e+02 -1.25474185e+00 1.59002530e+02 7.41658142e+00 2.05666214e-01 1.22391988e+02
1716.lowfreq: -3.4297 -0.0012 -0.0006 0.0006 5.5988 8.5841 15.8144 25.2149 30.6205
frequency: 14.7644 25.0378 30.6035 38.8029 40.3271 53.6692 66.3277 74.6556 85.8901 96.4515 109.5558 136.6871 142.5723 156.9390 165.6704 183.3146 201.6145 229.3945 268.3492 272.0991 296.1795 330.7689 352.8807 414.9310 425.8175 435.4451 478.3719 506.9175 538.3815 557.1910 558.6097 577.2307 603.4875 608.8653 627.1969 638.1433 657.2909 669.6568 685.7389 702.0002 720.9147 747.5393 775.5692 794.3685 826.2176 870.7838 881.5050 906.4204 938.0146 945.5905 967.6928 1001.1605 1017.8854 1032.1434 1052.4365 1056.4888 1064.4107 1074.4734 1087.6400 1129.4398 1136.0752 1194.4653 1205.2220 1226.8763 1237.0481 1256.7026 1264.1467 1268.4679 1286.6116 1306.8056 1319.8630 1334.7669 1341.4542 1349.8300 1370.4333 1373.2651 1394.7818 1451.8323 1454.1144 1456.4625 1466.5423 1470.0909 1501.6276 1539.0244 1579.3855 1629.6748 1635.9518 1652.3498 1670.6042 2980.5038 2986.4280 2991.3237 3011.4448 3017.0851 3040.9944 3076.0233 3085.5423 3097.0422 3106.0498 3116.9203 3311.1448 3449.9410 3503.3625 3505.4998 3515.2577
redmass: 7.0285 7.6950 6.0225 10.8629 9.3004 8.4111 7.0832 6.5434 5.3853 4.2014 3.7862 6.5075 4.9377 1.0775 4.5011 3.7853 5.3146 5.4026 6.9963 8.8651 4.0565 4.7525 5.4177 3.0586 3.6842 3.4111 2.8075 3.1699 2.9082 3.1976 3.6520 3.2339 3.1279 2.1882 1.6456 1.7032 1.2996 2.9198 1.9751 2.7614 4.3244 4.0502 1.4859 1.4828 3.7084 3.3372 5.1497 3.3995 3.1032 4.7756 2.7414 1.6176 2.7513 2.7998 1.8599 1.8152 2.3242 3.0335 2.4994 3.2714 2.5632 1.2964 1.2797 1.3764 1.7278 1.3666 1.6334 1.6324 1.5940 1.3301 1.5937 1.4143 1.4187 1.9701 1.9511 1.6777 1.2385 1.1187 1.0892 1.0679 1.1004 1.1212 1.9581 1.7101 4.1098 5.6781 6.9393 8.2186 8.8519 1.0677 1.0656 1.0376 1.0844 1.0599 1.0828 1.1001 1.0973 1.1001 1.0930 1.1003 1.0818 1.0800 1.0637 1.0639 1.0642
irintensity: 1.2865 0.4770 1.4097 1.5720 2.2010 1.2329 0.5601 4.7378 3.3023 2.6231 10.5148 8.4211 9.2896 0.7265 8.3549 4.7796 0.7575 16.7489 3.1388 3.5300 4.1063 0.4589 2.0026 19.9363 16.3059 41.7705 1.3804 69.3987 84.8817 39.7591 21.5835 7.5658 60.6196 51.1474 53.5724 112.6317 117.6469 29.1305 111.9337 65.7021 16.8320 16.3071 49.9488 123.4469 3.0831 3.3250 11.6373 11.2175 30.3660 5.6327 39.5804 6.2975 32.7458 311.1605 115.5950 12.0321 135.3462 289.5722 5.8051 48.2982 58.8922 9.4437 13.5482 5.2551 36.4805 4.5306 7.2001 37.5759 24.1931 11.0905 17.0266 15.0374 20.1732 58.0051 164.6141 9.7914 65.6038 64.1879 15.4672 4.2957 35.6407 56.8373 255.4979 246.1706 58.4919 281.9257 160.2568 254.0973 167.4337 45.9795 19.1706 8.8890 7.4322 11.3237 15.3320 6.0173 6.8549 14.6130 5.4998 10.3556 182.6456 169.0132 25.5455 32.9294 31.9447
temp: 298.150 k
press: 1.00000 atm
elementType: 8 8 8 8 8 8 8 8 7 7 6 6 6 6 6 6 6 6 6 6 6 1 1 1 1 1 1 1 1 1 1 1 1 1 1 1 1
symmnumber: 1
zpe: 736406.6 jmol-1
zpe.correction: 0.280482 hartree
zpe.thermalcorrener: 0.303065 hartree
zpe.thermalcorrenthalpy: 0.304009 hartree
zpe.thermalcorrgfe: 0.224479 hartree
zpe.sumelectzpe: -1138.516671 hartree
zpe.sumelectthermal: -1138.494088 hartree
zpe.sumelectthermalent: -1138.493144 hartree
zpe.sumelectthermalfe: -1138.572674 hartree
dipole: -0.2857 0.9259 0.2033
dipole: 0.9901
quadrupole: -92.6495 -116.9561 -137.0786
quadrupole: -1.6918 -6.8482 -0.0649
quadrupole: 22.9119 -1.3947 -21.5172 -1.6918 -6.8482 -0.0649
hfenergy: -1138.7971533 hartree
pointgroup: C01 [X(C11H16N2O8)]
dipole: -0.1474338 0.3495781 0.0883082 debye
polarizability: 194.6091083|1.5247061|158.9313583|10.3903848|2.4005448|123.2507921 unknown
InChI: InChI=1S/C11H16N2O8/c1-5(14)12-7(4-9(17)18)10(19)13-6(11(20)21)2-3-8(15)16/h6-7,12-13,15,17,20H,2-4H2,1H3
charge 0 multiplicity 1
37 atoms
O  -0.807528 -1.722011 -1.840842
O  3.758224 -2.602218 -0.12608
O  2.374097 -2.34083 1.724037
O  -5.609493 -1.271561 0.025601
O  4.081334 2.861226 0.118127
O  -4.695691 0.708572 -0.752321
O  2.005948 2.937941 -0.913379
O  -0.402773 0.957676 1.688499
N  0.376643 -1.188794 0.104254
N  -2.008459 0.766147 0.022021
C  1.694924 -1.427037 -0.485895
C  2.358248 -0.094691 -0.964389
C  -2.033162 -0.712653 0.075446
C  -0.76535 -1.275198 -0.652242
C  -3.283845 -1.311282 -0.618249
C  2.727083 0.857788 0.205089
C  2.589936 -2.161507 0.508445
C  -4.551456 -0.507215 -0.459071
C  2.863033 2.289369 -0.267774
C  -1.203485 1.512391 0.853407
C  -1.2752 3.019136 0.687412
H  1.551657 -2.067908 -1.374817
H  1.634535 0.401739 -1.635325
H  3.260162 -0.338795 -1.5531
H  -1.990039 -1.008359 1.141041
H  0.300614 -0.694536 1.011985
H  -3.047543 -1.385425 -1.699949
H  -3.444244 -2.336451 -0.25305
H  3.656617 0.544403 0.706521
H  1.914061 0.864436 0.95908
H  -2.711767 1.224656 -0.570901
H  -2.19097 3.352543 0.170648
H  -1.218725 3.496191 1.678991
H  -0.396722 3.349087 0.10144
H  4.342526 -3.061223 0.536571
H  -6.432236 -0.711334 0.075807
H  4.111744 3.808626 -0.189841
