program: Gaussian 09
title: 000196851
version: EM64L-G09RevD.01
frameworkgroup: C1[X(C22H29NO3)]
method: RPBEPBE
basis: SDD
operation: Freq
keyword: #p
keyword: freq=noraman
keyword: PBEPBE/SDD
title: #p freq=noraman PBEPBE/SDD
converged: YES YES NO NO
title: Mulliken charges:
elementType: O O O N C C C C C C C C C C C C C C C C C C C C C C H H H H H H H H H H H H H H H H H H H H H H H H H H H H H
charge: -0.288719 -0.300337 -0.229335 -0.290063 -0.043794 -0.397818 -0.330314 -0.324824 -0.381324 -0.476751 0.258433 0.106229 -0.505704 0.114160 0.452998 -0.679179 -0.355438 -0.319303 -0.513229 -0.232052 -0.254739 -0.410829 -0.389304 -0.256313 -0.239832 -0.253642 0.215856 0.216123 0.203484 0.222799 0.221174 0.255798 0.176743 0.209859 0.217641 0.186274 0.234740 0.244178 0.232442 0.238322 0.218865 0.206855 0.214334 0.253089 0.285770 0.201448 0.238199 0.219086 0.230630 0.235136 0.255009 0.231627 0.229454 0.221614 0.224478
chargesum: 0.00000
title: Mulliken charges with hydrogens summed into heavy atoms:
elementType: O O O N C C C C C C C C C C C C C C C C C C C C C C
charge: -0.288719 -0.300337 -0.229335 -0.034265 0.172061 0.021790 0.113659 0.061778 0.022591 0.002166 0.258433 0.106229 -0.034940 0.114160 0.452998 -0.039124 -0.102349 -0.033533 0.145503 -0.001423 -0.019603 -0.155820 -0.157677 -0.026860 -0.018218 -0.029164
polarizability: 3.27795912e+02 -9.05324903e+00 2.80388297e+02 -2.30802332e+01 -1.20346314e+01 1.64377051e+02
1716.lowfreq: -5.1637 -2.6542 -0.0004 0.0003 0.0006 3.0218 6.9842 17.8700 25.9605
frequency: 6.0069 17.6344 25.9200 37.8418 43.0948 50.1776 52.6566 59.6164 69.1879 72.3859 88.0996 105.6370 118.0644 125.5707 148.3234 153.2575 157.9889 179.2009 190.9499 205.1764 213.5448 222.7792 240.7600 242.5421 255.5366 287.8051 347.0331 359.6140 376.7776 405.3955 411.2809 422.6508 445.3707 471.3919 505.0832 520.2595 527.2804 545.4580 551.4799 578.2971 604.1097 616.8357 643.2078 702.0545 715.9237 736.6959 745.2950 748.2868 756.0790 766.0918 790.1692 794.7015 815.1140 839.2271 857.6565 863.5318 885.6720 891.7666 911.0404 917.3708 963.0274 967.1289 978.6356 983.4360 985.4239 991.4348 994.5951 1001.3268 1021.3447 1026.6515 1028.0992 1042.9527 1052.6763 1064.7526 1067.7915 1090.0772 1093.7663 1110.8258 1113.9641 1117.9249 1130.5699 1136.1214 1152.8451 1158.2322 1168.5747 1173.1538 1179.0802 1186.4983 1190.7043 1194.8618 1204.7632 1214.2036 1224.4111 1256.2285 1266.8211 1272.9916 1281.7831 1283.6416 1293.9771 1302.0638 1319.2465 1321.8682 1354.9060 1361.4685 1367.5264 1382.5551 1384.1462 1387.1304 1394.5820 1410.3518 1430.8438 1434.7670 1436.8097 1444.8364 1454.1595 1458.2398 1465.3491 1466.6921 1471.6272 1472.6856 1477.9972 1479.7146 1482.3455 1484.9621 1494.0129 1561.0826 1581.1531 1590.1637 1610.7572 1615.2015 2849.3190 2863.5621 2941.2053 2967.6185 2970.4356 2976.3838 2981.3950 2982.6165 2989.5681 2993.8151 3021.2765 3022.2813 3023.0181 3034.7440 3039.8443 3045.6176 3072.9411 3077.4430 3106.6188 3110.8429 3124.3854 3134.0407 3137.7489 3148.9806 3150.2726 3162.8659 3163.9122 3174.0052 3423.7568
redmass: 4.1298 4.0775 4.9609 4.4234 2.8390 4.1268 3.1713 3.0822 3.0737 3.1761 2.7962 2.7116 2.5701 3.3027 2.4664 2.2456 2.2686 3.3785 3.0115 3.1123 4.9989 1.2025 2.5165 3.7855 4.6518 3.2994 5.5012 3.7847 3.6691 2.9038 4.7845 3.2943 4.1172 2.8668 2.5264 3.1947 3.9488 5.7586 5.5469 2.3100 5.7000 6.3676 6.2595 2.6437 1.3820 2.2198 4.8501 1.3508 1.0960 1.3369 3.6883 1.7339 3.1323 4.1952 1.2454 1.4515 1.2333 1.7370 1.3765 1.5350 7.0202 1.3622 1.3860 4.6167 3.5451 5.7570 1.3342 1.3469 2.1321 2.1917 3.6111 2.5257 2.1365 2.1840 2.4802 2.1976 2.3137 1.4610 1.8122 1.7298 2.0014 1.4704 3.4116 1.1724 1.0597 1.1688 1.7594 1.4536 1.3917 1.2740 2.1047 2.5163 1.3196 1.2863 1.6339 1.1160 1.0886 1.8541 1.2532 1.2530 1.3165 1.3980 1.5270 1.6509 1.8799 5.5406 3.4619 1.4157 1.3525 1.1622 2.2213 1.1604 2.1730 1.2021 1.1191 1.2052 1.2853 1.1109 1.0774 1.0554 1.0434 1.3812 1.0701 2.2642 1.0877 7.0775 7.0237 5.9213 6.5398 6.1239 1.0710 1.0706 1.0336 1.0651 1.0565 1.0365 1.0820 1.0630 1.0619 1.0838 1.1010 1.0898 1.0940 1.0981 1.1082 1.0985 1.1007 1.0992 1.0986 1.0865 1.0871 1.0862 1.0918 1.0898 1.0946 1.0997 1.0942 1.0988 1.0734
irintensity: 0.4154 0.5543 0.7764 0.4938 0.5374 1.3707 0.8455 2.3245 0.1572 0.2072 1.4718 0.9356 5.8345 1.3975 1.6476 0.5337 2.5096 2.1291 4.5704 3.7241 3.1233 0.5174 1.1283 2.5053 0.5734 3.5695 10.8819 6.3900 0.8057 0.7207 9.1701 0.9045 7.3708 10.9998 1.3182 4.7638 1.1271 1.9110 7.8655 0.6017 9.1941 1.1960 13.9123 13.3798 21.3713 20.2968 4.3633 66.5591 32.9146 109.7137 15.1652 14.9173 12.6016 4.6210 0.5119 0.1482 3.3542 3.0287 1.9959 2.8471 62.2106 1.2604 0.7298 16.3660 24.1952 8.8181 0.7460 0.3271 4.3406 11.1285 46.8745 80.1811 7.5409 17.6450 5.9194 16.9014 4.0999 4.8731 33.5777 6.1718 14.6205 46.4639 41.6032 1.1499 2.3573 44.5158 6.5415 42.1003 41.6985 5.6568 9.4287 114.3680 7.3993 4.4760 14.9723 0.3762 1.8005 114.9472 4.2721 0.2740 6.1370 37.4215 1.6955 4.1564 32.5614 1.5273 15.9642 0.6994 18.2041 21.5035 87.9483 18.3138 11.9832 29.1203 12.5904 37.6261 72.6849 24.2051 0.9076 8.3466 12.9962 13.7621 3.4770 17.5662 10.2571 79.9371 73.0501 1.5558 103.1480 6.9067 83.9320 125.9259 61.8647 26.0394 26.8798 34.6846 43.8125 4.9496 13.5789 36.0492 54.2376 40.3351 2.1644 22.3965 33.5645 23.9866 80.0338 44.4889 30.5942 6.6580 3.5418 5.1468 26.4083 3.9891 54.5940 9.3027 20.4757 21.0863 1.1328
temp: 298.150 k
press: 1.00000 atm
elementType: 8 8 8 7 6 6 6 6 6 6 6 6 6 6 6 6 6 6 6 6 6 6 6 6 6 6 1 1 1 1 1 1 1 1 1 1 1 1 1 1 1 1 1 1 1 1 1 1 1 1 1 1 1 1 1
symmnumber: 1
zpe: 1212373.5 jmol-1
zpe.correction: 0.461769 hartree
zpe.thermalcorrener: 0.489164 hartree
zpe.thermalcorrenthalpy: 0.490108 hartree
zpe.thermalcorrgfe: 0.399054 hartree
zpe.sumelectzpe: -1134.166755 hartree
zpe.sumelectthermal: -1134.139360 hartree
zpe.sumelectthermalent: -1134.138416 hartree
zpe.sumelectthermalfe: -1134.229469 hartree
dipole: 0.2250 -5.0687 1.4325
dipole: 5.2720
quadrupole: -144.6296 -157.1947 -154.1595
quadrupole: -10.7866 1.2960 -2.3395
quadrupole: 7.3650 -5.2001 -2.1649 -10.7866 1.2960 -2.3395
hfenergy: -1134.6285238 hartree
pointgroup: C01 [X(C22H29N1O3)]
dipole: 1.8036096 0.8300783 -0.6001018 debye
polarizability: 299.3539159|-21.8237242|296.1414803|12.3532841|-48.393869|177.0658643 unknown
InChI: InChI=1S/C22H29NO3/c1-3-15-23-16-19(25-2)17-26-22-12-8-7-11-20(22)21(24)14-13-18-9-5-4-6-10-18/h4-12,19,23H,3,13-17H2,1-2H3
charge 0 multiplicity 1
55 atoms
O  1.694201 -1.155382 0.027833
O  2.979368 1.935914 -1.561219
O  -1.264482 -3.953619 1.252512
N  0.645809 3.004888 -0.20532
C  2.014225 1.061608 -0.863017
C  1.453849 1.882174 0.302912
C  2.744761 -0.211633 -0.398991
C  0.007764 3.828076 0.847008
C  -0.76346 5.01501 0.238419
C  -1.006732 -1.777397 0.211145
C  2.067382 -2.409372 0.532893
C  1.024516 -3.31272 0.921007
C  -2.541009 -1.741308 0.139926
C  -0.464956 -3.065121 0.823586
C  -3.122024 -0.504694 -0.543185
C  -1.426048 5.901927 1.313861
C  3.429629 -2.785442 0.664159
C  1.41245 -4.577598 1.44552
C  3.115862 1.641359 -2.991495
C  3.771497 -4.049498 1.18467
C  2.759683 -4.954251 1.581599
C  -2.360477 0.658478 -0.826667
C  -4.497692 -0.501969 -0.901913
C  -2.951302 1.785151 -1.445415
C  -5.0933 0.619704 -1.51741
C  -4.319754 1.772812 -1.793862
H  1.184371 0.789075 -1.548917
H  0.813721 1.225091 0.922536
H  2.312057 2.207842 0.94421
H  3.331018 -0.652451 -1.229441
H  3.424217 0.01945 0.445252
H  1.217893 3.58109 -0.840561
H  0.748538 4.219309 1.591285
H  -0.697467 3.183706 1.409739
H  -1.530155 4.621107 -0.455538
H  -0.067182 5.629046 -0.37048
H  -0.607928 -0.928529 0.800627
H  -0.554794 -1.644381 -0.791138
H  -2.900447 -2.650955 -0.377547
H  -2.949998 -1.82309 1.166621
H  -1.973951 6.744128 0.854023
H  -0.672427 6.325803 2.004108
H  -2.147921 5.320734 1.917598
H  4.225565 -2.098433 0.364634
H  0.600315 -5.251062 1.739108
H  3.505479 0.618653 -3.174961
H  3.837256 2.375405 -3.383517
H  2.145624 1.755249 -3.516427
H  4.828159 -4.323717 1.279394
H  3.021288 -5.936433 1.987356
H  -1.297205 0.710624 -0.5713
H  -5.104612 -1.393228 -0.695882
H  -2.328424 2.66356 -1.650062
H  -6.156236 0.594278 -1.784649
H  -4.778414 2.644429 -2.274726
