program: Gaussian 09
title: 000188750
version: EM64L-G09RevD.01
frameworkgroup: C1[X(C17H20O5)]
method: RPBEPBE
basis: SDD
operation: Freq
keyword: #pfreq=noraman
keyword: PBEPBE/SDD
title: #p freq=noraman PBEPBE/SDD
converged: YES YES NO NO
title: Mulliken charges:
elementType: O O O O O C C C C C C C C C C C C C C C C C H H H H H H H H H H H H H H H H H H H H
charge: -0.260108 -0.452205 -0.272704 -0.253860 -0.198446 -0.174469 0.286985 -0.364928 0.020543 0.222877 0.611550 0.429570 -0.391497 -0.449692 -0.207590 -0.833755 -0.271138 -0.765827 -0.317893 0.114420 -0.686049 -0.537533 0.274426 0.258543 0.243733 0.237893 0.194398 0.196763 0.245667 0.219608 0.242188 0.243533 0.345268 0.221039 0.220155 0.251745 0.202513 0.228379 0.224061 0.251473 0.226758 0.223606
chargesum: 0.00000
title: Mulliken charges with hydrogens summed into heavy atoms:
elementType: O O O O O C C C C C C C C C C C C C C C C C
charge: -0.260108 -0.106937 -0.272704 -0.253860 -0.198446 0.099957 0.286985 -0.106386 0.020543 0.222877 0.611550 0.429570 -0.147764 -0.211800 0.183571 -0.126291 -0.027605 -0.324633 -0.066148 0.114420 -0.031096 0.164303
polarizability: 2.64369557e+02 3.23425781e+01 2.46333813e+02 4.26353768e+00 -4.31143814e+00 1.33700486e+02
1716.lowfreq: -6.6125 -2.4461 -0.0004 -0.0001 0.0003 8.2130 23.6784 27.7737 44.9206
frequency: 23.5952 27.7451 44.9034 53.2851 59.1162 61.3979 71.1188 100.5083 104.4376 125.3002 139.6576 156.9277 179.3654 197.1567 213.5471 225.2180 237.1042 251.5017 262.2153 279.2756 293.3040 306.7355 315.4469 344.8519 369.5007 376.8716 419.0905 435.6554 451.9843 476.1310 492.6804 509.7838 558.3087 563.6727 588.8033 613.0918 625.8961 682.6296 688.5737 712.1894 729.5396 751.1778 773.4178 797.6582 811.5662 817.0183 839.5993 842.1091 848.7148 901.4351 936.7696 949.4209 950.1496 961.6767 985.4789 985.7757 999.7124 1019.1037 1043.9132 1050.8605 1055.6197 1063.1553 1079.7515 1109.5414 1118.4684 1137.8340 1146.2265 1168.0362 1195.3116 1212.5178 1229.1894 1250.6178 1252.8813 1256.7654 1285.9412 1300.1981 1316.8692 1338.6381 1371.7405 1383.3437 1390.5465 1393.8177 1397.1555 1399.2450 1431.5180 1436.0310 1438.4911 1458.6211 1467.9571 1469.6278 1471.4083 1478.7932 1480.8181 1489.3215 1492.7531 1549.4229 1603.8393 1618.0252 1663.8038 1685.7376 2932.4096 2967.0318 2974.4688 2982.3311 2991.4603 3013.5802 3042.9363 3054.6261 3059.6822 3085.4517 3089.1462 3089.7347 3098.1765 3130.4929 3131.6199 3136.2723 3175.7366 3188.4262 3188.5082 3563.3598
redmass: 4.0787 3.8831 3.9569 4.2187 3.4043 1.7650 3.6518 5.2825 4.8041 4.5210 6.9018 4.2010 3.9848 2.7986 1.3298 1.3446 1.3747 2.4553 3.8776 2.7434 3.1237 2.9109 1.3868 4.6939 4.7252 7.3093 3.6979 3.8762 4.2549 4.1012 5.0269 3.8902 3.4806 2.9227 4.2673 6.9412 4.4721 5.0328 4.0824 1.7855 3.0359 4.7979 5.2611 1.6232 1.7851 1.8427 3.4358 1.6378 3.2102 6.4552 1.3409 1.4556 2.2231 4.0276 2.0479 1.5018 4.2325 1.6244 2.5289 1.7765 4.0412 3.5017 2.7287 1.2565 2.0006 1.4495 1.3915 1.4808 1.6670 1.5759 1.6656 1.6581 2.0148 1.8303 1.7493 1.7202 1.2385 1.3638 1.5219 1.3131 1.3350 3.4511 1.4088 2.1379 1.5440 1.7659 1.2919 1.0414 1.0748 1.0729 1.0777 1.0543 1.1302 2.1727 1.1018 8.9578 6.7957 7.2583 5.0239 10.7335 1.0552 1.0326 1.0373 1.1065 1.0357 1.0827 1.0857 1.0957 1.1044 1.0628 1.0990 1.0993 1.1009 1.0997 1.0907 1.0898 1.0938 1.0956 1.1135 1.0662
irintensity: 0.6800 0.1541 3.4242 0.5073 0.4182 2.0613 4.7714 3.3446 1.1712 0.6173 1.8245 0.9333 5.4902 0.3755 0.3570 0.3760 0.1722 9.1298 1.1578 2.9659 19.0240 20.8747 89.4294 2.9050 0.9269 5.2823 0.3471 6.0719 1.0563 9.7944 6.6216 12.8097 4.9823 26.8781 5.8995 10.9228 5.2409 4.3290 2.8707 3.6463 21.3959 19.8366 8.0134 7.6903 24.3517 14.5920 21.5932 66.9689 6.6791 27.7138 2.8889 30.5102 81.5970 73.1506 8.9243 2.7017 27.5564 27.8938 74.2224 1.9636 131.6373 72.6892 91.5024 0.3643 16.0199 3.8579 3.6161 2.1956 10.6788 69.7250 21.3816 58.3872 129.4066 17.1725 7.0308 3.0075 2.1819 16.7807 8.2630 8.3054 31.3383 16.5716 15.2904 19.2667 1.9889 17.9555 5.1729 11.4600 18.4564 37.5996 21.5945 4.7598 21.9403 18.7178 2.0548 83.0261 171.1587 260.4082 11.8183 437.7402 42.7717 78.0916 16.1881 44.0271 27.7655 8.2296 17.8628 17.6396 38.2562 13.2823 29.4504 25.2142 35.3977 16.3116 12.5932 8.6768 12.4704 4.1024 22.9337 5.6416
temp: 298.150 k
press: 1.00000 atm
elementType: 8 8 8 8 8 6 6 6 6 6 6 6 6 6 6 6 6 6 6 6 6 6 1 1 1 1 1 1 1 1 1 1 1 1 1 1 1 1 1 1 1 1
symmnumber: 1
zpe: 876974.6 jmol-1
zpe.correction: 0.334022 hartree
zpe.thermalcorrener: 0.356865 hartree
zpe.thermalcorrenthalpy: 0.357810 hartree
zpe.thermalcorrgfe: 0.280696 hartree
zpe.sumelectzpe: -1034.233729 hartree
zpe.sumelectthermal: -1034.210885 hartree
zpe.sumelectthermalent: -1034.209941 hartree
zpe.sumelectthermalfe: -1034.287055 hartree
dipole: -0.1222 6.8774 0.0601
dipole: 6.8787
quadrupole: -117.0009 -122.4186 -127.4345
quadrupole: -11.1346 -3.8942 -2.1815
quadrupole: 5.2838 -0.1340 -5.1498 -11.1346 -3.8942 -2.1815
hfenergy: -1034.5677506 hartree
pointgroup: C01 [X(C17H20O5)]
dipole: -0.0126926 2.6926803 0.2707838 debye
polarizability: 264.7649387|-33.2964941|243.0364691|9.0486683|14.2223466|136.602447 unknown
InChI: InChI=1S/C17H20O5/c1-5-21-17(15(19)10(2)3)14-12(20-4)8-6-11-7-9-13(18)22-16(11)14/h6-9,15,17,19H,2,5H2,1,3-4H3
charge 0 multiplicity 1
42 atoms
O  -1.690705 -0.084796 -1.457881
O  -1.477379 -0.570649 2.178861
O  1.598186 -1.303996 0.0084
O  -1.342327 2.476092 0.211982
O  2.915672 -3.190544 -0.138032
C  -1.045777 -0.369277 -0.162676
C  0.113529 0.579762 0.129246
C  -2.176929 -0.322833 0.889056
C  1.431867 0.07452 0.208378
C  -0.039525 1.986844 0.303111
C  -3.262436 -1.369078 0.663649
C  2.573455 0.897074 0.466958
C  1.078027 2.835123 0.556007
C  2.364827 2.289251 0.640974
C  -0.847501 -0.447439 -2.611954
C  -2.821188 -2.807597 0.475932
C  3.872105 0.270684 0.537912
C  -4.568985 -0.993913 0.693099
C  4.032398 -1.08571 0.352412
C  2.901412 -1.961636 0.066198
C  -1.687829 -0.230891 -3.869683
C  -1.560871 3.922454 0.320546
H  -0.629033 -1.394784 -0.174759
H  -2.633042 0.683417 0.8894
H  0.938494 3.910334 0.691991
H  3.224858 2.938319 0.841859
H  0.064808 0.186967 -2.630998
H  -0.523562 -1.506969 -2.517897
H  -2.050998 -3.0842 1.219448
H  -3.67076 -3.505619 0.565866
H  -2.372692 -2.950252 -0.526387
H  4.745113 0.901001 0.745895
H  -2.164996 -0.595706 2.891814
H  -4.859917 0.05771 0.807689
H  -5.381732 -1.721033 0.580653
H  5.009349 -1.571965 0.40541
H  -1.101858 -0.484145 -4.772278
H  -2.590779 -0.865141 -3.846425
H  -2.008908 0.822801 -3.942553
H  -2.643753 4.052389 0.181573
H  -1.01534 4.469945 -0.471155
H  -1.262573 4.302189 1.316464
