program: Gaussian 09
title: 000188735
version: EM64L-G09RevD.01
frameworkgroup: C1[X(C23H20F2N2O3)]
method: RPBEPBE
basis: SDD
operation: Freq
keyword: #p
keyword: freq=noraman
keyword: PBEPBE/SDD
title: #p freq=noraman PBEPBE/SDD
converged: YES YES NO NO
title: Mulliken charges:
elementType: F F O O O N N C C C C C C C C C C C C C C C C C C C C C C C H H H H H H H H H H H H H H H H H H H H
charge: -0.196839 -0.160568 -0.265482 -0.277307 -0.262787 -0.471900 -0.447970 -0.588440 0.486510 -0.295381 -0.562620 0.441955 -0.419039 0.347475 -0.403983 -0.217416 -0.812343 0.481726 -0.357458 -0.342210 -0.424511 -0.338008 -0.074258 0.231615 0.201359 0.276152 0.261802 -0.372815 -0.378598 -0.143401 0.227958 0.227815 0.221525 0.221661 0.238148 0.236367 0.231766 0.223943 0.224028 0.236097 0.225880 0.250734 0.250056 0.236487 0.299419 0.375732 0.369066 0.269599 0.269103 0.249355
chargesum: 0.00000
title: Mulliken charges with hydrogens summed into heavy atoms:
elementType: F F O O O N N C C C C C C C C C C C C C C C C C C C C C C C
charge: -0.196839 -0.160568 -0.265482 -0.277307 -0.262787 -0.096168 -0.078904 -0.132667 0.486510 0.147805 -0.324471 0.441955 -0.182672 0.347475 -0.172217 0.006527 -0.126338 0.481726 -0.106724 -0.092154 -0.188023 -0.038588 -0.074258 0.231615 0.201359 0.276152 0.261802 -0.103216 -0.109495 0.105954
polarizability: 4.96839830e+02 -7.70501507e+00 2.48735851e+02 -2.53534237e+00 5.42856687e+00 1.76148475e+02
1716.lowfreq: -2.5298 -0.8184 -0.0014 0.0010 0.0016 5.3477 7.5955 11.4705 18.8727
frequency: 7.2989 10.8133 18.7432 23.3217 31.8945 41.2265 45.7883 50.0625 58.7278 83.3062 97.7150 117.6139 127.2813 142.4916 149.5339 171.1498 197.3467 204.3655 217.5204 229.0199 237.3890 272.3745 275.9840 300.7907 323.8263 332.4194 382.0740 392.0591 393.6953 405.7291 415.3960 432.2629 450.4073 475.7480 493.9406 505.2128 515.0694 526.8129 527.4944 556.1104 570.2907 578.8293 598.6603 629.8222 650.3971 655.3053 674.8161 707.9637 720.9721 724.2345 731.7916 740.6336 757.1312 786.0319 802.2783 804.2039 810.0478 819.6206 834.1733 839.5425 880.5667 882.6848 887.5106 899.3093 909.2570 920.5906 940.7640 950.1555 965.7533 969.6750 970.3692 979.8759 982.1268 989.2567 992.0455 1002.0008 1039.6091 1048.0971 1053.0145 1070.7256 1100.7059 1106.9304 1124.3366 1167.0229 1168.6909 1173.9416 1178.5812 1183.7893 1190.9751 1210.0683 1218.3192 1233.1694 1252.7453 1258.3188 1274.4676 1277.3917 1297.9272 1311.4813 1312.6117 1369.5388 1375.6640 1379.1148 1381.0213 1395.9507 1426.7692 1431.3138 1436.0290 1437.4319 1458.4594 1470.9300 1472.4755 1473.3661 1485.6033 1486.8381 1504.9304 1536.6481 1569.8849 1585.7647 1599.0700 1617.4987 1618.6809 1623.6709 1628.9900 1671.1301 2955.2039 2975.1655 3008.7532 3015.3637 3056.3374 3072.6008 3084.4174 3107.2047 3115.5063 3124.6894 3128.5741 3151.2238 3159.1670 3163.4539 3169.0275 3184.0207 3190.4139 3194.1615 3252.2487 3527.2808
redmass: 4.2490 6.0425 6.9350 6.1670 5.4174 1.1201 5.7954 4.0603 4.6102 7.4132 6.8208 5.9947 10.0465 2.5996 5.5914 7.1128 7.7016 3.4028 5.0832 4.7861 8.3735 2.7691 6.2317 5.8690 8.2818 7.5476 6.2912 5.3672 3.1693 10.0868 3.1270 3.4744 3.9897 5.2294 5.2094 6.2630 5.7168 4.8014 2.8516 5.1024 5.2235 5.4014 4.9057 7.1530 2.3059 3.9924 3.9750 2.2775 3.6936 5.6836 3.1258 3.3966 2.2268 2.4385 2.1063 2.4324 1.2720 1.3251 6.1613 1.4570 1.1975 1.3986 6.1978 1.3119 1.6377 2.2444 7.3132 1.3578 6.6011 1.3559 1.3195 4.4672 1.5362 3.3365 1.8828 2.6064 1.5392 1.5667 2.3544 3.7865 1.5605 2.4929 1.3213 1.1259 1.5364 1.1769 1.4538 1.1154 2.8934 2.1180 2.4697 4.3369 2.6962 2.4380 2.8053 1.1779 1.5993 1.3975 1.2578 1.8709 10.7869 7.2145 2.7205 1.2247 3.7407 2.4465 2.5443 2.7658 3.1023 1.3433 1.0620 1.1882 1.4551 1.3085 2.3147 3.0827 5.2969 6.9075 5.8875 4.0120 6.2642 4.5796 5.8553 4.6349 1.0550 1.0383 1.0595 1.1069 1.0953 1.1046 1.0997 1.0910 1.0861 1.0920 1.0899 1.0992 1.0895 1.0883 1.0951 1.0931 1.0950 1.0997 1.0819 1.0779
irintensity: 0.2667 0.4245 0.5598 0.4385 0.7432 0.2858 1.1330 0.1817 0.1466 1.2594 0.4358 1.8874 4.1166 9.2250 3.5508 1.7242 1.1923 5.9000 1.6336 0.0975 4.6811 1.5681 2.4651 4.1321 0.8240 6.1937 0.6420 2.3870 3.1330 14.3863 0.1397 12.0829 0.5581 0.5489 11.2638 11.6881 16.7303 5.4622 20.8025 4.3693 13.2982 25.1396 3.6046 5.4589 34.8817 3.6999 1.2233 26.3164 17.3781 7.1558 31.3387 34.4588 9.7222 6.5530 53.1212 65.5176 9.3314 10.1275 3.6357 37.2448 122.7573 0.2570 4.5914 3.2917 6.3720 6.3845 47.3057 6.3719 113.1697 6.5136 3.4073 72.2480 13.2056 0.5831 0.1367 11.3343 1.0613 17.7646 8.3475 28.8306 11.0406 1.7514 21.8214 3.3748 2.7007 9.4289 323.4955 0.7907 56.2374 25.5487 385.4880 5.4426 155.9147 2.2174 94.1252 0.1375 3.4609 10.8280 0.3326 35.3899 2.4834 0.2109 2.8253 12.2548 131.9988 1.7598 108.1324 64.4328 290.4259 13.0690 12.9235 26.3896 16.8564 62.9844 175.8232 540.6316 33.6067 84.9796 7.1759 132.5713 32.5172 4.2842 102.4232 330.2022 35.8075 35.8066 24.1688 18.7838 21.7698 21.6158 18.3262 19.6442 1.6660 30.4351 11.5021 27.4356 17.5153 4.0210 5.9764 0.4802 6.0119 2.1147 278.1751 54.5048
temp: 298.150 k
press: 1.00000 atm
elementType: 9 9 8 8 8 7 7 6 6 6 6 6 6 6 6 6 6 6 6 6 6 6 6 6 6 6 6 6 6 6 1 1 1 1 1 1 1 1 1 1 1 1 1 1 1 1 1 1 1 1
symmnumber: 1
zpe: 999618.8 jmol-1
zpe.correction: 0.380735 hartree
zpe.thermalcorrener: 0.408078 hartree
zpe.thermalcorrenthalpy: 0.409022 hartree
zpe.thermalcorrgfe: 0.316510 hartree
zpe.sumelectzpe: -1421.216367 hartree
zpe.sumelectthermal: -1421.189023 hartree
zpe.sumelectthermalent: -1421.188079 hartree
zpe.sumelectthermalfe: -1421.280592 hartree
dipole: 3.5357 1.2971 -0.0329
dipole: 3.7663
quadrupole: -86.2960 -178.8440 -172.6107
quadrupole: 1.7053 2.1811 -2.6531
quadrupole: 59.6209 -32.9271 -26.6938 1.7053 2.1811 -2.6531
hfenergy: -1421.5971017 hartree
pointgroup: C01 [X(C23H20F2N2O3)]
dipole: -1.4169025 0.1473501 -0.4078468 debye
polarizability: 495.2720718|5.930389|180.5531492|-20.3882924|-18.3888475|245.8989348 unknown
InChI: InChI=1S/C23H20F2N2O3/c1-15-4-2-5-16(14-15)12-13-30-18-10-8-17(9-11-18)26-23(29)27-22(28)21-19(24)6-3-7-20(21)25/h2-11,14,26-27H,12-13H2,1H3
charge 0 multiplicity 1
50 atoms
F  -6.251683 1.248459 -1.734394
F  -6.683362 -1.273827 2.392391
O  3.550195 0.098089 1.666396
O  -2.15765 -0.178564 -1.855625
O  -4.377607 0.136941 1.729847
N  -1.987374 0.009004 0.502714
N  -4.098971 -0.083968 -0.579627
C  5.940943 0.060195 1.308092
C  7.073329 -0.019602 0.292727
C  4.571872 0.009292 0.608885
C  7.632624 1.159244 -0.260137
C  8.657328 1.113327 -1.239484
C  7.555742 -1.276468 -0.153786
C  2.201618 0.067522 1.273867
C  9.117869 -0.156329 -1.672929
C  8.572625 -1.342351 -1.131385
C  9.265592 2.392834 -1.789005
C  -0.577243 0.02436 0.700165
C  1.256996 0.152689 2.327652
C  1.750718 -0.039035 -0.0642
C  -0.116551 0.131469 2.042576
C  0.368334 -0.060492 -0.352152
C  -6.372498 0.018167 0.358273
C  -2.653238 -0.086028 -0.695801
C  -4.879898 0.034123 0.563663
C  -7.036387 0.641301 -0.728341
C  -7.236223 -0.584479 1.312434
C  -8.428528 0.705729 -0.875343
C  -8.637293 -0.55724 1.214431
C  -9.231701 0.098945 0.115141
H  5.997777 0.997402 1.890931
H  5.994848 -0.778295 2.026218
H  4.459528 0.857097 -0.097817
H  4.451863 -0.939537 0.046855
H  7.265954 2.136039 0.083969
H  7.138775 -2.199258 0.268612
H  9.906655 -0.214466 -2.433032
H  8.941057 -2.316777 -1.472031
H  9.683688 2.240607 -2.799509
H  10.090312 2.750375 -1.141988
H  8.519841 3.205623 -1.846213
H  1.620079 0.234162 3.356363
H  2.459025 -0.106685 -0.894965
H  -0.84063 0.197368 2.863612
H  0.019111 -0.14193 -1.383324
H  -2.600473 0.080723 1.337673
H  -4.552058 -0.110017 -1.497874
H  -8.858472 1.217627 -1.739703
H  -9.235761 -1.047905 1.986078
H  -10.321294 0.133338 0.026603
