program: Gaussian 09
title: 000188734
version: EM64L-G09RevD.01
frameworkgroup: C1[X(C23H20F2N2O3)]
method: RPBEPBE
basis: SDD
operation: Freq
keyword: #p
keyword: freq=noraman
keyword: PBEPBE/SDD
title: #p freq=noraman PBEPBE/SDD
converged: YES YES NO NO
title: Mulliken charges:
elementType: F F O O O N N C C C C C C C C C C C C C C C C C C C C C C C H H H H H H H H H H H H H H H H H H H H
charge: -0.160302 -0.197180 -0.264703 -0.277494 -0.262885 -0.472072 -0.448537 -0.583899 0.357549 -0.308238 0.282612 -0.406647 -0.406088 -0.834615 0.350225 -0.245587 -0.236503 0.481603 -0.358396 -0.342562 -0.424548 -0.337876 0.231915 -0.074412 0.201669 0.262133 0.276652 -0.378525 -0.372717 -0.143508 0.233070 0.231481 0.223896 0.217080 0.235347 0.229820 0.230638 0.230001 0.236484 0.227020 0.226747 0.250810 0.250439 0.236652 0.299875 0.375746 0.369474 0.269171 0.269707 0.249474
chargesum: 0.00000
title: Mulliken charges with hydrogens summed into heavy atoms:
elementType: F F O O O N N C C C C C C C C C C C C C C C C C C C C C C C
charge: -0.160302 -0.197180 -0.264703 -0.277494 -0.262885 -0.096326 -0.079063 -0.119348 0.357549 0.132738 0.282612 -0.171300 -0.176268 -0.137492 0.350225 -0.018567 -0.009756 0.481603 -0.107585 -0.092123 -0.187895 -0.038001 0.231915 -0.074412 0.201669 0.262133 0.276652 -0.109354 -0.103010 0.105967
polarizability: 4.94071486e+02 -8.92720554e+00 2.45466650e+02 1.14458184e+01 -3.86337764e+00 1.78407690e+02
1716.lowfreq: -13.7589 -2.1425 -0.0016 -0.0006 0.0014 2.1189 8.4679 13.4156 22.5930
frequency: 4.2063 12.2951 22.5531 25.3402 31.1716 46.3281 52.1414 64.1517 84.9029 97.9067 112.1413 127.0101 133.5561 148.0562 155.2730 167.9919 185.4599 198.0142 228.7458 232.5908 245.7078 278.7538 302.9143 311.1131 326.3271 334.5135 382.2458 391.7723 399.1151 408.0465 415.3690 434.2566 458.5673 475.9839 493.4694 502.0641 516.8976 527.5222 539.0972 553.5187 568.9306 578.2287 598.7981 629.7799 650.3429 654.5461 674.4305 721.2167 724.3475 728.3409 735.5883 743.7102 757.2107 763.1521 786.9247 803.9168 811.7849 821.2778 831.3060 840.5621 846.6537 874.7956 882.1702 882.7230 887.8021 940.4665 946.0464 950.2646 965.7732 969.5599 970.2585 979.5426 985.2518 987.4610 1001.9913 1014.2861 1039.5663 1053.1879 1053.6209 1069.1630 1106.9366 1119.2704 1124.5143 1167.1139 1173.2783 1176.0435 1178.6461 1189.9535 1191.7315 1210.1033 1217.9813 1233.0140 1233.3089 1252.9098 1274.4938 1277.3915 1291.6435 1298.9040 1311.6709 1370.5110 1375.7573 1376.1312 1381.8286 1398.7803 1426.6606 1433.0927 1436.2544 1437.4460 1458.7071 1468.4697 1469.7978 1481.1926 1486.7702 1491.8249 1504.9194 1536.8233 1569.8988 1585.8479 1588.5298 1614.7762 1617.6599 1623.8602 1628.9307 1670.7638 2956.6124 2974.0057 3012.5868 3016.2126 3049.5546 3074.6910 3083.5165 3112.5409 3118.8731 3128.3680 3137.5838 3159.1321 3159.7594 3163.5035 3169.1971 3183.9870 3191.3397 3194.1445 3252.5851 3526.4203
redmass: 6.7539 5.3063 5.8741 5.6022 6.0131 6.4731 5.8050 4.3166 7.6785 6.7516 4.3204 8.8994 1.1191 6.2476 2.3667 6.4461 3.8901 7.7375 4.8887 7.0247 5.2686 7.6391 4.9390 2.9373 6.8128 6.0948 6.3919 8.8280 3.3456 5.9965 3.1214 3.9405 3.4816 5.1478 4.9325 5.4505 6.6143 2.4688 6.9605 3.9257 5.6618 5.5207 5.5522 7.1757 2.6420 3.3158 3.9577 3.6403 4.8569 3.7818 2.5713 2.5467 2.2222 1.6064 4.0911 2.4005 1.2872 1.4029 4.8332 1.5247 3.6496 1.3598 1.2343 1.3980 5.3042 6.6769 1.4573 1.3580 6.3619 1.3603 1.3213 7.2889 1.5913 1.3269 2.6152 1.7207 1.6041 2.3566 1.8673 3.6522 2.4917 1.7404 1.3233 1.1255 1.0956 1.1435 1.4551 2.3577 2.7453 2.1242 2.4949 2.7096 3.4584 2.7093 2.7759 1.2687 1.3130 1.3993 1.3962 2.0792 10.7661 6.0806 2.3432 1.2450 3.7383 2.0242 2.5394 2.7683 3.0904 1.1222 1.1170 1.4141 1.5678 1.2065 2.2570 3.0878 5.3045 6.8796 6.4616 6.2823 4.0441 4.5522 5.7999 4.5901 1.0551 1.0380 1.0723 1.0933 1.0965 1.1037 1.0986 1.0870 1.0886 1.0899 1.0930 1.0895 1.1006 1.0883 1.0951 1.0931 1.0949 1.0997 1.0819 1.0779
irintensity: 0.2406 0.5393 0.3892 0.6629 0.5539 0.8936 0.2093 0.0626 1.4318 0.9680 2.3054 4.9112 0.3836 9.0364 1.4148 2.0577 0.6580 1.2669 0.0816 0.8972 10.0208 6.2428 0.8979 1.9136 0.9668 6.4611 0.5718 3.1266 9.7104 7.1443 0.1090 12.3445 1.1975 0.6436 11.7540 3.7726 26.0547 23.7211 5.0161 10.0066 12.8033 19.3772 6.5218 5.8143 30.0333 7.4808 1.5237 16.1420 1.7964 12.9976 49.4522 32.3150 10.3215 36.4627 16.8030 70.4130 6.4699 16.7245 7.7498 30.8010 10.5140 2.8788 119.4670 0.3234 6.8719 50.6352 5.2895 6.6215 113.7342 7.0979 3.1352 82.5901 1.5561 0.1214 12.1385 0.1752 15.5973 8.9484 9.2052 22.0939 1.7582 9.9154 22.2890 3.2862 0.3421 25.5322 311.7233 3.2540 52.0178 25.0719 373.3479 15.9864 3.4816 155.7002 89.7267 1.1466 5.8160 0.9169 11.7740 34.8284 2.4677 0.7664 3.5063 12.9681 128.7101 1.3489 111.5134 61.8577 296.7467 24.7871 6.4545 45.6069 29.8828 47.8551 163.4576 542.8099 32.0639 86.2835 0.6493 1.9853 136.2981 4.5068 105.1314 329.2082 34.6637 28.2330 20.5837 25.5817 21.2239 28.0179 21.8432 15.7147 4.2775 11.6847 32.2506 20.6860 30.8480 3.9919 5.9511 0.4667 6.1078 2.0975 279.1205 55.2653
temp: 298.150 k
press: 1.00000 atm
elementType: 9 9 8 8 8 7 7 6 6 6 6 6 6 6 6 6 6 6 6 6 6 6 6 6 6 6 6 6 6 6 1 1 1 1 1 1 1 1 1 1 1 1 1 1 1 1 1 1 1 1
symmnumber: 1
zpe: 1000561.5 jmol-1
zpe.correction: 0.381094 hartree
zpe.thermalcorrener: 0.408150 hartree
zpe.thermalcorrenthalpy: 0.409094 hartree
zpe.thermalcorrgfe: 0.317867 hartree
zpe.sumelectzpe: -1421.214504 hartree
zpe.sumelectthermal: -1421.187448 hartree
zpe.sumelectthermalent: -1421.186504 hartree
zpe.sumelectthermalfe: -1421.277731 hartree
dipole: 4.0145 0.9630 0.3225
dipole: 4.1410
quadrupole: -93.5038 -179.4901 -172.0015
quadrupole: 3.1501 -1.5228 2.0210
quadrupole: 54.8280 -31.1583 -23.6698 3.1501 -1.5228 2.0210
hfenergy: -1421.5955982 hartree
pointgroup: C01 [X(C23H20F2N2O3)]
dipole: -1.5912315 -0.3393715 -0.0841462 debye
polarizability: 490.1135656|5.5704912|202.0175317|-35.5395988|31.9233396|225.8147288 unknown
InChI: InChI=1S/C23H20F2N2O3/c1-15-5-2-3-6-16(15)13-14-30-18-11-9-17(10-12-18)26-23(29)27-22(28)21-19(24)7-4-8-20(21)25/h2-12,26-27H,13-14H2,1H3
charge 0 multiplicity 1
50 atoms
F  -6.535286 2.058435 1.780467
F  -6.114996 -1.929155 -0.95959
O  3.730791 0.897037 1.036744
O  -2.124366 -0.535225 -1.908847
O  -4.17406 0.604762 1.609295
N  -1.847754 0.299904 0.293823
N  -4.003013 -0.159236 -0.592114
C  6.099836 0.817213 0.563961
C  7.189868 0.418854 -0.423916
C  4.701003 0.533736 -0.010655
C  7.734228 -0.902227 -0.443209
C  7.64903 1.370401 -1.369469
C  8.719941 -1.219563 -1.412264
C  7.297996 -1.958231 0.560863
C  2.366525 0.716645 0.752619
C  8.629863 1.041248 -2.330673
C  9.168398 -0.264365 -2.352014
C  -0.432196 0.421478 0.389841
C  1.474476 1.056475 1.80073
C  1.85339 0.232649 -0.475207
C  0.090815 0.909803 1.620192
C  0.460933 0.084922 -0.657946
C  -2.566337 -0.147845 -0.78898
C  -6.226207 0.052715 0.443818
C  -4.728565 0.185048 0.54203
C  -7.086636 0.961389 1.117767
C  -6.893841 -0.991446 -0.244636
C  -8.486016 0.838814 1.129278
C  -8.283892 -1.167791 -0.262738
C  -9.082516 -0.237957 0.438647
H  6.16469 1.894895 0.799176
H  6.196479 0.26972 1.518052
H  4.520625 1.140727 -0.921232
H  4.586257 -0.538298 -0.272875
H  7.234416 2.386278 -1.34353
H  9.142509 -2.231741 -1.427515
H  7.774947 -2.928786 0.342327
H  6.203192 -2.114801 0.555444
H  7.575658 -1.67536 1.594541
H  8.971417 1.79394 -3.049864
H  9.931517 -0.536739 -3.08977
H  1.885471 1.430593 2.742992
H  2.520651 -0.033743 -1.300019
H  -0.592547 1.174385 2.436093
H  0.063299 -0.288842 -1.603477
H  -2.420845 0.564263 1.11836
H  -4.492826 -0.5426 -1.405948
H  -9.08194 1.580731 1.666689
H  -8.715547 -2.009553 -0.809666
H  -10.170432 -0.350359 0.442005
