program: Gaussian 09
title: 000188726
version: EM64L-G09RevD.01
frameworkgroup: C1[X(C13H12Cl2N2O2S)]
method: RPBEPBE
basis: SDD
operation: Freq
keyword: #p
keyword: freq=noraman
keyword: PBEPBE/SDD
title: #p freq=noraman PBEPBE/SDD
converged: YES YES NO NO
title: Mulliken charges:
elementType: Cl Cl S O O N N C C C C C C C C C C C C C H H H H H H H H H H H H
charge: 0.016191 -0.028353 1.020864 -0.512711 -0.531390 -0.496450 0.002558 -0.578801 0.552859 0.478733 -0.717742 -0.226671 -0.319459 -0.307793 -0.468874 -0.194531 -0.219034 -0.103350 -0.185430 -0.331098 0.240754 0.264470 0.267954 0.291461 0.274681 0.259055 0.241636 0.289678 0.284961 0.263267 0.230249 0.242320
chargesum: 0.00000
title: Mulliken charges with hydrogens summed into heavy atoms:
elementType: Cl Cl S O O N N C C C C C C C C C C C C C
charge: 0.016191 -0.028353 1.020864 -0.512711 -0.531390 -0.496450 0.002558 -0.073578 0.552859 0.478733 0.116354 -0.226671 -0.060405 -0.066157 -0.179196 0.090430 0.044232 -0.103350 0.044819 -0.088778
polarizability: 2.47580798e+02 -1.82656426e+01 2.08313468e+02 -2.03583070e+01 -1.93606856e+01 1.56952367e+02
1716.lowfreq: -5.2212 -0.0014 -0.0012 0.0015 4.1544 5.8247 17.2070 33.1030 42.1808
frequency: 17.1595 33.0857 42.1708 49.3333 53.7792 73.4984 96.1127 128.0493 152.1665 163.0427 165.3619 169.9247 189.3643 197.7211 219.7088 241.2967 271.2814 295.0183 332.7565 339.4360 371.5013 380.8410 383.8773 405.0553 436.6046 461.1919 480.5440 510.3225 562.1412 580.4176 611.9439 629.3142 644.8034 674.6215 720.3315 726.8080 777.6033 803.6075 806.5532 826.0340 833.8245 869.6754 903.4339 931.1567 944.1483 952.7181 963.7362 970.4546 984.9124 988.5888 1007.6991 1022.8225 1027.1400 1048.8825 1081.1437 1115.8947 1130.6689 1190.6355 1225.9848 1233.2834 1241.3197 1261.3743 1305.1698 1312.7937 1340.0202 1343.9659 1358.8917 1374.5548 1410.3561 1417.3615 1418.6619 1434.7540 1446.3106 1458.5514 1551.1377 1560.2015 1576.5855 1587.1008 2978.5237 3033.0945 3050.4288 3120.0596 3130.7978 3133.1808 3152.9993 3163.3937 3179.5182 3181.2811 3183.1923 3190.9200
redmass: 8.0276 7.0761 5.0925 6.9252 7.5100 6.3476 7.0763 6.5940 3.9028 4.4931 1.2630 6.4487 6.5804 5.6876 9.4363 9.1344 4.8242 5.5135 5.1762 3.1988 7.1613 5.5641 3.5086 4.9071 4.9753 4.4397 5.5396 6.2618 4.4201 8.1720 6.6496 5.8169 6.3382 6.5767 2.1614 3.0317 3.7947 7.8476 4.8661 1.5457 2.0702 1.4028 2.8275 1.3495 1.7032 1.5607 1.7157 1.3851 1.7536 2.4254 3.7370 2.2049 3.3238 3.0141 2.6518 1.5814 1.3956 1.5236 1.9504 1.8087 1.5671 1.7153 1.1385 5.1632 4.6390 1.2174 1.3930 3.1272 1.0539 1.1709 1.7204 1.2530 2.2257 1.9973 8.5944 5.5016 7.1345 5.6826 1.0632 1.0245 1.0985 1.0889 1.0900 1.0938 1.0893 1.0996 1.0963 1.1074 1.0940 1.1079
irintensity: 1.5774 3.9949 1.3009 0.2453 0.5993 0.6190 0.8413 0.2070 3.7600 0.2185 1.2512 0.6345 2.0793 2.6837 0.9449 1.8032 1.1600 2.2549 27.8037 10.1386 14.2029 30.6051 4.6532 7.1312 25.5755 1.7847 15.2115 2.3964 19.5014 66.8453 4.9189 9.5492 25.3869 27.6934 24.3833 27.5911 44.6876 20.9107 62.9545 15.1330 39.4549 18.2026 31.6603 1.4142 4.5903 8.4176 15.6590 49.9349 3.8455 10.0400 10.0022 40.8180 2.7538 39.1070 51.0431 10.2797 3.0271 2.0450 3.3143 16.7894 4.5169 21.8307 4.7110 1.7292 4.7423 3.1955 4.0165 15.8650 9.6497 13.3941 21.2923 25.7765 103.3464 19.9376 16.4631 5.9981 77.5484 3.7115 23.5796 0.5430 0.2986 4.8611 22.6946 1.3601 2.4475 26.8122 0.8984 0.4209 1.7520 0.7914
temp: 298.150 k
press: 1.00000 atm
elementType: 17 17 16 8 8 7 7 6 6 6 6 6 6 6 6 6 6 6 6 6 1 1 1 1 1 1 1 1 1 1 1 1
symmnumber: 1
zpe: 588249.8 jmol-1
zpe.correction: 0.224053 hartree
zpe.thermalcorrener: 0.244267 hartree
zpe.thermalcorrenthalpy: 0.245211 hartree
zpe.thermalcorrgfe: 0.172686 hartree
zpe.sumelectzpe: -2079.065948 hartree
zpe.sumelectthermal: -2079.045733 hartree
zpe.sumelectthermalent: -2079.044789 hartree
zpe.sumelectthermalfe: -2079.117314 hartree
dipole: 3.1657 1.3470 -6.4558
dipole: 7.3153
quadrupole: -157.3264 -121.0956 -136.2531
quadrupole: -3.8405 5.0724 -10.2258
quadrupole: -19.1014 17.1294 1.9720 -3.8405 5.0724 -10.2258
hfenergy: -2079.2900003 hartree
pointgroup: C01 [X(C13H12Cl2N2O2S1)]
dipole: 1.1774829 0.3195186 2.6066769 debye
polarizability: 222.3144215|30.2971398|227.5626605|28.2069678|-13.7116474|162.9695514 unknown
InChI: InChI=1S/C13H12Cl2N2O2S/c1-20(18,19)17(9-10-3-2-6-16-8-10)13-5-4-11(14)7-12(13)15/h2-8H,9H2,1H3
charge 0 multiplicity 1
32 atoms
Cl -0.056444 0.330329 -2.025518
Cl 4.445791 2.964006 -0.250119
S  0.083601 -2.737027 -0.117115
O  1.132693 -2.636835 -1.351024
O  -1.470748 -3.194135 -0.304857
N  0.082683 -1.112698 0.868885
N  -3.822271 0.723011 -0.990629
C  -1.246329 -0.741344 1.443853
C  1.075526 -0.146686 0.522513
C  -2.084303 0.275339 0.684698
C  0.856034 -3.925783 1.160717
C  1.150621 0.577311 -0.705472
C  2.081555 0.114893 1.495463
C  -1.975151 1.661187 0.952446
C  -3.027088 -0.139145 -0.292969
C  2.175911 1.515259 -0.947415
C  3.102437 1.062336 1.288627
C  3.132197 1.747416 0.057642
C  -2.780451 2.57032 0.23158
C  -3.684963 2.057549 -0.726055
H  -1.036695 -0.361605 2.463675
H  -1.814685 -1.684214 1.546374
H  0.207067 -3.897412 2.045678
H  0.866702 -4.912216 0.675722
H  1.865995 -3.543879 1.359538
H  2.034097 -0.448625 2.432903
H  -1.271295 2.022958 1.712402
H  -3.135745 -1.203273 -0.534473
H  2.219891 2.05021 -1.89913
H  3.858687 1.253872 2.054191
H  -2.71836 3.648711 0.408874
H  -4.332656 2.72717 -1.303809
