program: Gaussian 09
title: 000188715
version: EM64L-G09RevD.01
frameworkgroup: C1[X(C25H18ClFN4O3S)]
method: RPBEPBE
basis: SDD
operation: Freq
keyword: #p
keyword: freq=noraman
keyword: PBEPBE/SDD
title: #p freq=noraman PBEPBE/SDD
converged: YES YES NO NO
title: Mulliken charges:
elementType: Cl S F O O O N N N N C C C C C C C C C C C C C C C C C C C C C C C C C H H H H H H H H H H H H H H H H H H
charge: -0.063649 0.349287 -0.197437 -0.163523 -0.273104 -0.287355 -0.224352 -0.394288 -0.071969 -0.108357 -0.117727 -0.740077 0.144882 0.600855 -0.182973 0.245108 -0.326909 -0.395474 0.212875 -0.385793 -0.393693 -0.367553 0.275826 0.323157 -0.360291 -0.358952 0.392389 -0.234228 -0.221034 -0.221507 -0.309962 -0.364523 -0.210396 -0.189092 -0.116659 0.314018 0.314826 0.318494 0.287773 0.241555 0.246032 0.253578 0.266511 0.262373 0.231131 0.269856 0.235854 0.236634 0.237113 0.255433 0.254289 0.254514 0.256514
chargesum: 0.00000
title: Mulliken charges with hydrogens summed into heavy atoms:
elementType: Cl S F O O O N N N N C C C C C C C C C C C C C C C C C C C C C C C C C
charge: -0.063649 0.349287 -0.197437 -0.163523 -0.273104 -0.287355 -0.224352 -0.075794 -0.071969 -0.108357 0.196291 -0.425251 0.144882 0.600855 -0.182973 0.245108 -0.039136 -0.153919 0.212875 0.113817 -0.127182 -0.105181 0.275826 0.323157 -0.129160 -0.089096 0.392389 0.001627 0.015599 0.015606 -0.054529 -0.110234 0.044117 0.067423 -0.116659
polarizability: 4.30034741e+02 1.50869392e+01 3.52568316e+02 -6.17889224e+00 2.06535799e+01 2.43809334e+02
1716.lowfreq: -0.0012 -0.0009 -0.0004 1.7512 2.2467 4.3056 8.7271 14.9277 19.3483
frequency: 8.4427 14.7386 19.3468 23.7738 29.0482 41.6673 45.2040 45.9348 56.0205 76.2968 76.9504 97.6856 106.0664 130.8665 140.8865 152.4896 157.9930 164.5016 182.6728 207.7798 219.7560 247.7196 254.7432 268.5809 314.3155 316.5208 335.0661 340.2846 356.2671 373.2851 378.0772 400.3066 404.5520 413.3145 413.7765 416.4870 427.1224 439.2176 454.7634 468.9906 497.3935 500.9048 509.2835 524.3873 550.5959 582.1481 606.7029 614.1862 620.1002 626.0351 638.2089 642.0189 663.8465 676.3655 691.1241 694.8756 705.0260 706.1450 740.8048 749.4087 764.5035 784.8880 796.0571 801.4488 819.3143 820.9766 823.1657 837.9631 845.7445 857.2354 877.1031 914.5064 927.8493 938.2726 947.5245 948.6960 951.1098 952.8702 966.0251 980.8086 985.7681 990.4227 991.2141 1001.3036 1006.6468 1007.2347 1024.4155 1040.6731 1072.4497 1079.3970 1093.0816 1110.1844 1113.1079 1160.0183 1163.9960 1175.1016 1175.8340 1183.1418 1192.3744 1193.0372 1204.4756 1214.3956 1215.8806 1220.1526 1238.3269 1257.8963 1265.6734 1290.8230 1298.9979 1304.6060 1313.8018 1319.5551 1339.4367 1359.5440 1369.9109 1382.6140 1385.9781 1393.4949 1404.4663 1419.0796 1433.2252 1449.5719 1465.1741 1475.0748 1488.9850 1498.8207 1499.4172 1572.3704 1586.5846 1599.9915 1603.7064 1604.2582 1611.4590 1612.3862 1630.0240 2946.3707 2998.4469 3031.7810 3065.0483 3121.7429 3134.8353 3135.9569 3149.1225 3149.9908 3157.7681 3159.1581 3161.5906 3172.9152 3176.1120 3178.3407 3180.0739 3180.6127 3561.0749
redmass: 9.3102 9.3228 6.6505 5.6292 4.2948 6.0155 6.3169 9.6538 5.6073 7.4565 7.1905 8.4604 9.0206 9.5697 9.0050 7.7501 6.3632 7.8964 6.7477 7.4934 10.1058 5.1914 6.0046 5.7929 8.4142 7.0799 7.3294 6.7300 6.4700 6.2008 5.5424 4.0669 3.9052 3.9010 3.4368 3.3881 5.9921 6.7264 5.0199 7.3840 2.7417 5.1353 4.8893 3.3446 1.4752 6.0715 6.7822 6.3863 7.4163 7.9295 6.4825 10.5154 5.9512 4.7583 4.5756 3.4979 3.7057 2.0539 4.6306 5.1830 6.0304 6.3129 2.4780 1.3036 1.3163 3.1320 2.0146 5.6238 1.6764 1.2501 5.9945 7.3992 1.3751 1.4845 1.6074 3.5772 2.2826 2.1181 1.3642 4.6546 1.5941 3.8300 4.0210 2.5436 2.8432 1.3527 2.4890 4.6237 2.5789 2.1975 2.1453 1.3056 1.3955 1.5183 1.7678 1.1977 1.0596 1.8736 1.3528 1.1586 1.4960 3.9613 4.6346 4.1681 1.6924 2.0162 2.8381 1.2875 2.0695 1.3261 2.8033 1.3328 1.5639 1.9240 7.5412 2.9146 9.0480 5.0203 3.6983 2.4905 2.2140 1.1727 1.9407 2.2047 2.3865 5.1583 3.1185 5.7653 7.3832 7.1662 6.4020 6.7241 5.9898 6.2352 11.5959 1.0799 1.0554 1.0864 1.1073 1.0881 1.0905 1.0871 1.0918 1.0909 1.0878 1.0884 1.0960 1.1009 1.0967 1.0953 1.0978 1.0962 1.0776
irintensity: 0.4313 0.3434 0.2432 0.4018 0.1917 0.1577 0.1315 0.3564 1.6560 0.4126 3.2234 9.4934 2.9075 1.9107 0.9959 2.6179 1.6590 2.8975 0.5821 3.5307 2.6784 3.6940 4.4099 32.2907 2.6604 1.1560 3.3872 5.2098 0.3356 2.1935 1.0953 4.2653 5.1017 6.0519 2.6662 3.9265 2.7538 12.2438 14.5407 1.7472 23.6806 1.2859 42.8997 32.5622 72.9919 13.0879 21.9594 0.6185 8.3863 17.8667 2.4961 11.8035 5.0759 8.0153 2.0993 0.2984 25.5513 77.7726 9.6019 20.3301 9.1484 18.9170 12.8539 10.0145 7.2854 54.0166 33.3610 19.6885 72.7582 1.0909 0.8562 28.2598 1.3434 1.8568 2.4258 4.4274 39.0999 25.2973 1.5419 8.9599 1.8796 0.6465 38.5090 25.5635 9.8159 0.3789 15.1368 9.2517 47.4104 13.9404 4.2079 13.3653 7.5517 80.7469 21.7892 60.4146 1.3716 19.6948 28.2254 15.8001 2.5270 337.1764 20.9850 67.5682 43.2250 43.7686 25.8244 1.8415 300.5948 2.3046 187.3252 0.2742 20.5719 64.6284 162.2911 84.3485 1.6547 2.2127 1.2752 2.9737 6.5663 87.9395 197.2026 187.4896 109.2258 28.3214 65.2146 90.6233 23.2617 8.8244 54.6851 21.2444 17.4161 63.7200 166.0649 63.4159 20.7268 4.1487 10.1526 7.6497 6.4680 1.3701 15.3923 2.1254 12.2155 1.2055 14.1761 18.6545 6.8786 0.6505 1.1378 3.8593 18.3496
temp: 298.150 k
press: 1.00000 atm
elementType: 17 16 9 8 8 8 7 7 7 7 6 6 6 6 6 6 6 6 6 6 6 6 6 6 6 6 6 6 6 6 6 6 6 6 6 1 1 1 1 1 1 1 1 1 1 1 1 1 1 1 1 1 1
symmnumber: 1
zpe: 998090.1 jmol-1
zpe.correction: 0.380152 hartree
zpe.thermalcorrener: 0.410392 hartree
zpe.thermalcorrenthalpy: 0.411337 hartree
zpe.thermalcorrgfe: 0.313153 hartree
zpe.sumelectzpe: -2363.633611 hartree
zpe.sumelectthermal: -2363.603371 hartree
zpe.sumelectthermalent: -2363.602427 hartree
zpe.sumelectthermalfe: -2363.700611 hartree
dipole: -1.7115 5.1101 1.9051
dipole: 5.7159
quadrupole: -243.4108 -231.3972 -208.1029
quadrupole: -6.0817 -7.5879 -2.8868
quadrupole: -15.7738 -3.7602 19.5341 -6.0817 -7.5879 -2.8868
hfenergy: -2364.0137634 hartree
pointgroup: C01 [X(C25H18Cl1F1N4O3S1)]
dipole: 0.9220651 1.6452626 -1.2247869 debye
polarizability: 424.3410386|-27.2899167|341.0468822|-5.1037135|-44.7681524|261.0244705 unknown
InChI: InChI=1S/C25H18ClFN4O3S/c26-17-8-12-19(13-9-17)34-14-20-29-30-25-31(20)24(33)21(28-23(32)16-4-2-1-3-5-16)22(35-25)15-6-10-18(27)11-7-15/h1-13,21-22,28H,14H2
charge 0 multiplicity 1
53 atoms
Cl -7.927057 2.73357 -1.806133
S  1.520969 -3.32078 1.285148
F  7.096208 -1.873086 -1.797302
O  -1.099198 0.400066 0.897868
O  -3.693705 -1.086864 0.159447
O  2.957936 1.320018 1.789763
N  -0.918898 -1.874378 1.389895
N  1.491162 0.681721 0.107866
N  -1.058969 -4.039856 2.074043
N  -2.364743 -3.43468 2.159231
C  1.158302 -0.569764 0.772007
C  1.680521 -1.839419 0.035104
C  -0.372082 -0.61195 1.006625
C  3.115635 -1.800611 -0.4362
C  -0.228041 -3.096522 1.610552
C  -2.268596 -2.166437 1.738785
C  4.158441 -1.273133 0.371075
C  3.434034 -2.357951 -1.701939
C  2.321629 1.61452 0.72725
C  -3.430177 -1.242036 1.606528
C  5.493688 -1.294402 -0.08057
C  4.764004 -2.386195 -2.171123
C  2.436768 2.952621 0.060203
C  5.765087 -1.851045 -1.342807
C  1.40455 3.499893 -0.747301
C  3.618551 3.702928 0.288151
C  -4.695571 -0.172497 -0.210263
C  1.567338 4.772032 -1.33732
C  3.781397 4.96971 -0.308274
C  2.75839 5.505032 -1.126836
C  -5.496402 0.55705 0.702494
C  -4.882683 -0.018605 -1.606694
C  -6.482362 1.444908 0.212094
C  -5.865116 0.864111 -2.094587
C  -6.653317 1.588084 -1.17527
H  1.6543 -0.517543 1.767575
H  1.012547 -2.105978 -0.803923
H  0.976151 0.945398 -0.73298
H  3.935883 -0.821986 1.343494
H  2.63761 -2.777935 -2.32719
H  -3.21486 -0.253483 2.051799
H  -4.295228 -1.715979 2.106689
H  6.307578 -0.887816 0.525926
H  5.023798 -2.810355 -3.144773
H  0.452118 2.971365 -0.878393
H  4.389757 3.27721 0.937991
H  0.762889 5.195806 -1.947736
H  4.699719 5.540701 -0.135045
H  2.882965 6.491184 -1.58737
H  -5.377116 0.449729 1.784089
H  -4.257796 -0.598286 -2.292187
H  -7.106133 2.012352 0.908581
H  -6.016079 0.985057 -3.170954
