program: Gaussian 09
title: 000188711
version: EM64L-G09RevD.01
frameworkgroup: C1[X(C24H16ClFN4O2S)]
method: RPBEPBE
basis: SDD
operation: Freq
keyword: #p
keyword: freq=noraman
keyword: PBEPBE/SDD
title: #p freq=noraman PBEPBE/SDD
converged: YES YES NO NO
title: Mulliken charges:
elementType: Cl S F O O N N N N C C C C C C C C C C C C C C C C C C C C C C C C H H H H H H H H H H H H H H H H
charge: -0.065457 0.346253 -0.198840 -0.153619 -0.289112 -0.222117 -0.407631 -0.075661 -0.102555 -0.116305 -0.740987 0.145766 0.606796 -0.190851 0.131252 -0.403556 -0.327536 0.209004 0.480647 -0.368295 -0.392034 0.271588 0.321912 -0.262129 -0.359596 -0.341867 -0.363559 -0.236809 -0.228287 -0.214416 -0.223362 -0.232375 -0.222819 0.319089 0.317152 0.325115 0.241676 0.289404 0.260959 0.266455 0.262434 0.273277 0.229069 0.258610 0.238838 0.239124 0.236048 0.233294 0.236013
chargesum: 0.00000
title: Mulliken charges with hydrogens summed into heavy atoms:
elementType: Cl S F O O N N N N C C C C C C C C C C C C C C C C C C C C C C C C
charge: -0.065457 0.346253 -0.198840 -0.153619 -0.289112 -0.222117 -0.082516 -0.075661 -0.102555 0.202784 -0.423835 0.145766 0.606796 -0.190851 0.131252 -0.161880 -0.038132 0.209004 0.480647 -0.107336 -0.125578 0.271588 0.321912 -0.262129 -0.097162 -0.068591 -0.134490 0.021801 0.010551 0.024707 0.012685 0.000920 0.013194
polarizability: 4.05089564e+02 1.64640263e+01 3.17296869e+02 -2.19901366e+01 1.15275522e+01 2.58052686e+02
1716.lowfreq: -5.9391 -3.9920 0.0003 0.0012 0.0018 5.3427 15.0740 17.6885 19.1103
frequency: 14.8840 17.6820 18.9326 30.6789 33.7138 47.2489 52.0274 58.9782 75.0875 87.5733 95.3782 123.5384 133.4930 139.9249 149.7947 167.6751 175.7131 200.7432 221.3185 240.3475 255.6366 274.9877 294.0026 332.0422 339.3035 352.5585 365.3094 376.2512 392.3081 401.4238 404.1312 414.8833 435.0013 445.1036 448.6106 465.0353 471.1384 509.1772 509.4239 524.5435 539.2836 553.6585 611.4229 613.9469 615.1138 635.7935 638.6141 649.4188 665.5971 678.9205 691.0240 703.9212 709.2528 719.4366 731.4029 742.1112 753.8357 765.8646 785.7927 794.0349 819.3823 838.8559 845.1933 856.7023 872.8855 878.4728 916.5609 930.5490 938.5390 946.9727 955.0852 963.7127 986.0970 987.2888 990.7867 991.2538 1006.3780 1007.2118 1009.6675 1023.6569 1027.0085 1037.7559 1077.2403 1086.4314 1097.8727 1111.8594 1124.0957 1159.6019 1164.5743 1174.6644 1175.6268 1181.7319 1191.8202 1201.4461 1211.2988 1218.4421 1238.8816 1245.9874 1259.6690 1269.2919 1287.7251 1299.9553 1302.7390 1319.2056 1338.5348 1364.4795 1372.7756 1386.3869 1392.5345 1417.7180 1421.4156 1425.2398 1433.4692 1466.1810 1488.1442 1498.2121 1507.2101 1569.6084 1572.2657 1599.8712 1603.5917 1610.8059 1611.7699 1612.0239 1636.5245 2939.0758 3033.4765 3126.4128 3134.2836 3136.1060 3142.9823 3148.9741 3153.3599 3156.2148 3160.8798 3169.8213 3172.3686 3178.5775 3179.9969 3181.1448 3540.9400
redmass: 8.4860 9.1908 6.9799 4.3460 6.2697 5.9242 7.9933 8.3647 6.5238 7.7569 6.6374 13.4916 6.4946 7.0606 7.1769 5.8169 8.2712 7.7346 11.0831 6.7936 8.8652 6.7570 11.8957 4.7499 10.7116 6.2542 7.5020 6.4996 7.0403 3.8802 4.3974 2.9976 5.2765 4.2596 5.4392 4.8418 9.9234 4.7379 5.3564 3.3106 3.1254 1.9076 6.0154 6.7650 6.9524 9.1368 7.4407 7.0708 6.1310 4.8670 4.6185 1.5820 7.2815 7.5594 3.7825 4.1735 5.1584 1.3612 6.3684 2.3897 1.2647 5.5652 1.6787 1.2500 1.4228 6.0778 11.2263 8.1381 1.4480 1.3710 1.4060 1.3663 1.4889 5.5825 2.7248 1.7414 2.8517 1.3467 7.3555 2.7054 3.1920 4.4179 2.4908 1.8378 2.7154 1.4057 1.7022 1.5056 1.6987 1.0598 1.0579 1.9616 1.1807 1.5670 6.3457 3.0217 1.7478 1.8677 2.4492 2.9588 2.4053 2.0388 1.3260 1.3287 1.5624 8.8441 11.7345 9.2219 5.0444 2.4995 2.6125 2.5257 2.2124 1.8789 2.3348 2.6002 5.5012 6.1267 5.6309 7.2048 6.4975 7.4449 6.0333 6.2347 11.6609 1.0799 1.0864 1.0866 1.0906 1.0878 1.0861 1.0922 1.0907 1.0909 1.0961 1.0955 1.1009 1.0953 1.1004 1.0964 1.0770
irintensity: 0.3045 0.1967 0.2130 0.6850 0.4154 1.2681 0.4602 3.9990 1.1917 0.5801 7.7125 3.1982 0.7979 1.4874 1.0476 2.7258 0.5786 2.3131 1.8338 3.3787 0.9955 19.3841 0.7551 6.4984 0.7712 10.1025 3.5434 7.1184 5.5426 6.4156 1.8292 0.3569 12.7359 11.6573 6.3551 12.7227 4.2354 12.8752 45.3190 44.8187 17.0952 41.2534 6.5559 5.5686 6.3405 2.6980 2.9643 6.5788 3.7723 9.8803 3.6195 98.3204 9.9562 4.7402 13.0436 9.3186 8.5892 68.3917 14.2829 19.9255 2.4866 21.8604 73.8416 1.4511 0.5382 0.5610 13.3797 4.2324 1.2974 0.1522 2.0313 1.1374 2.1487 16.8841 0.8799 1.1944 9.6509 0.9109 24.5764 21.2191 8.4687 7.1889 8.2086 11.4798 1.4238 8.6058 4.5490 76.8572 19.8481 1.2141 0.8004 21.1129 25.9304 8.7416 12.7379 112.5862 18.0549 36.0468 112.3095 27.6527 56.2318 345.6587 71.7440 6.1856 23.6765 21.1543 221.8649 1.6846 1.4224 3.4182 14.6643 65.5557 4.3694 188.0644 103.5089 96.7448 5.5349 9.0803 85.5277 9.5362 53.6007 0.3613 17.1932 58.3095 164.4962 71.2433 3.4798 5.9581 6.5821 2.9665 1.4803 18.6849 1.8301 9.6589 14.2724 6.1918 19.7867 1.0901 13.9089 3.3370 23.3716
temp: 298.150 k
press: 1.00000 atm
elementType: 17 16 9 8 8 7 7 7 7 6 6 6 6 6 6 6 6 6 6 6 6 6 6 6 6 6 6 6 6 6 6 6 6 1 1 1 1 1 1 1 1 1 1 1 1 1 1 1 1
symmnumber: 1
zpe: 913992.5 jmol-1
zpe.correction: 0.348121 hartree
zpe.thermalcorrener: 0.375996 hartree
zpe.thermalcorrenthalpy: 0.376940 hartree
zpe.thermalcorrgfe: 0.285519 hartree
zpe.sumelectzpe: -2249.282962 hartree
zpe.sumelectthermal: -2249.255087 hartree
zpe.sumelectthermalent: -2249.254143 hartree
zpe.sumelectthermalfe: -2249.345564 hartree
dipole: -1.1329 6.2247 2.9562
dipole: 6.9836
quadrupole: -206.4111 -205.3125 -194.1926
quadrupole: 11.1357 -4.1740 -2.4101
quadrupole: -4.4391 -3.3404 7.7795 11.1357 -4.1740 -2.4101
hfenergy: -2249.631083 hartree
pointgroup: C01 [X(C24H16Cl1F1N4O2S1)]
dipole: 0.2712912 2.3575374 -1.3847087 debye
polarizability: 408.2035614|-10.1892451|312.1202948|-16.134958|-18.7561346|260.1152633 unknown
InChI: InChI=1S/C24H16ClFN4O2S/c25-18-9-5-4-8-17(18)21-28-29-24-30(21)23(32)19(27-22(31)15-6-2-1-3-7-15)20(33-24)14-10-12-16(26)13-11-14/h1-13,19-20,27H
charge 0 multiplicity 1
49 atoms
Cl -3.164099 -0.411465 -2.448815
S  0.188295 -3.097423 1.134919
F  6.5118 -2.498167 -0.442206
O  -1.678501 0.938211 0.113544
O  2.092077 1.251796 2.063705
N  -1.967661 -1.338593 0.559537
N  1.027637 0.831334 0.040236
N  -2.579737 -3.411714 1.270873
N  -3.766965 -2.646441 0.987978
C  0.358407 -0.347918 0.57673
C  0.865905 -1.694175 -0.023281
C  -1.166699 -0.167994 0.389108
C  2.363812 -1.866044 -0.118824
C  -1.536073 -2.619279 1.001478
C  -3.393661 -1.433432 0.543736
C  2.914672 -2.447138 -1.290275
C  3.228941 -1.507331 0.949134
C  1.848097 1.604109 0.865033
C  -4.353166 -0.403859 0.105354
C  4.303763 -2.662345 -1.41203
C  4.619289 -1.716226 0.846292
C  2.410691 2.856721 0.262246
C  5.124293 -2.289113 -0.334081
C  -4.37515 0.1485 -1.198751
C  -5.373974 -0.000506 1.007073
C  2.847702 3.87462 1.14852
C  2.540061 3.047248 -1.138977
C  -5.334348 1.093779 -1.597539
C  -6.34951 0.943669 0.626407
C  -6.324579 1.498794 -0.672642
C  3.382161 5.076451 0.641779
C  3.08086 4.249255 -1.643893
C  3.496247 5.268677 -0.755878
H  0.575933 -0.349532 1.669105
H  0.397236 -1.882626 -1.005878
H  0.634964 1.259663 -0.800931
H  2.25399 -2.738171 -2.115122
H  2.829055 -1.042929 1.856024
H  4.742523 -3.107705 -2.309072
H  5.29931 -1.438213 1.656103
H  -5.385256 -0.444142 2.007403
H  2.759623 3.699395 2.225555
H  2.263652 2.251075 -1.840209
H  -5.315493 1.496466 -2.613888
H  -7.123426 1.243315 1.339825
H  -7.074829 2.236177 -0.976336
H  3.71049 5.861278 1.331473
H  3.18749 4.386866 -2.725215
H  3.914253 6.201479 -1.150026
