program: Gaussian 09
title: 000188704
version: EM64L-G09RevD.01
frameworkgroup: C1[X(C22H20ClNO9)]
method: RPBEPBE
basis: SDD
operation: Freq
keyword: #p
keyword: freq=noraman
keyword: PBEPBE/SDD
title: #p freq=noraman PBEPBE/SDD
converged: NO YES NO NO
title: Mulliken charges:
elementType: Cl O O O O O O O O O N C C C C C C C C C C C C C C C C C C C C C C H H H H H H H H H H H H H H H H H H H H
charge: -0.041882 -0.242020 -0.230153 -0.461101 -0.471080 -0.455194 -0.403819 -0.204879 -0.292166 -0.263313 -0.056085 -0.146914 -0.148554 -0.113067 -0.014087 -0.103554 0.177610 -0.394725 0.305784 0.544838 -0.697930 -0.496681 -0.427424 0.030651 0.231522 -0.359217 0.071379 0.332383 -0.340857 -0.361068 -0.209115 -0.206254 -0.112675 0.230620 0.245910 0.259163 0.230915 0.258562 0.375403 0.379738 0.370541 0.264143 0.226864 0.242248 0.235912 0.282784 0.244443 0.386727 0.258064 0.268500 0.277909 0.259843 0.261354
chargesum: 0.00000
title: Mulliken charges with hydrogens summed into heavy atoms:
elementType: Cl O O O O O O O O O N C C C C C C C C C C C C C C C C C C C C C C
charge: -0.041882 -0.242020 -0.230153 -0.085698 -0.091342 -0.084653 -0.017092 -0.204879 -0.292166 -0.263313 -0.056085 0.083706 0.097356 0.146096 0.216828 0.155008 0.177610 -0.130583 0.305784 0.544838 0.007094 -0.213897 -0.182981 0.030651 0.231522 -0.101153 0.071379 0.332383 -0.072357 -0.083158 0.050728 0.055101 -0.112675
polarizability: 4.59850218e+02 7.32709464e+01 2.30051001e+02 3.93377830e+01 -1.41352456e+01 2.60624859e+02
1716.lowfreq: -11.2726 -5.9031 -1.6466 -0.0017 -0.0012 -0.0006 2.0593 9.7031 12.6851
frequency: -4.6503 9.4799 12.6208 28.6194 34.6622 45.6131 51.3535 54.8938 61.1270 75.4834 83.8772 97.7413 103.4025 125.4492 140.0686 147.3070 173.3249 207.2759 211.3937 214.9315 224.3220 244.5860 245.8130 250.3766 260.2006 267.6130 279.5019 287.8143 317.2167 335.3337 343.3764 383.3565 403.8710 406.3578 408.3806 413.5301 426.0136 438.3085 441.5429 454.5786 469.0160 478.5803 499.3813 521.8931 534.4392 543.3230 557.8182 592.3595 610.1482 615.6079 622.6099 628.0896 633.6524 665.4621 677.4919 694.1491 704.8641 713.0737 726.6793 730.8863 754.3415 768.3336 805.7540 823.0452 835.2416 836.3277 844.8455 846.8840 893.5344 903.6990 910.5634 928.7551 948.1104 950.5312 970.9640 971.5265 972.7241 982.0757 1005.4706 1008.0608 1015.3112 1024.2016 1029.3320 1042.7976 1056.9533 1064.5447 1071.2509 1071.9843 1073.8205 1080.8972 1093.5748 1108.1210 1119.0472 1134.5100 1145.4688 1177.1625 1185.2119 1185.7368 1218.6898 1224.6107 1229.2213 1240.3155 1251.3004 1258.1559 1266.7972 1273.5886 1295.4288 1301.4851 1304.4867 1314.6204 1316.6015 1331.0496 1345.3984 1361.6117 1370.4086 1385.9296 1394.2343 1396.5627 1397.3654 1403.6311 1413.3851 1430.5648 1458.9222 1461.3768 1471.9447 1477.3029 1544.2440 1577.2835 1598.6247 1607.9991 1614.9532 1626.8699 1679.3800 2958.2034 2961.5831 2985.0570 2997.7295 3005.4238 3025.3908 3046.1012 3094.4395 3110.4362 3145.0369 3159.3041 3161.4466 3161.7094 3177.6985 3180.5944 3181.6291 3279.3690 3510.6877 3555.0978 3557.0110
redmass: 8.8935 5.5625 7.0991 8.7380 9.8556 7.7755 5.3133 6.8404 7.9885 8.3737 6.5276 7.6546 6.6290 7.2123 5.1389 6.2777 5.9900 4.9437 1.3216 3.3257 4.1522 6.4777 6.2060 6.7826 5.9621 5.8632 6.3132 5.9054 5.5408 5.5240 5.2899 5.7762 1.7868 3.5438 2.9213 3.7175 4.4894 3.3214 3.3204 1.3407 3.8299 5.9744 3.2616 5.5762 5.2688 5.6772 4.2430 6.4982 5.3116 1.5013 6.9268 4.0188 3.9876 2.1563 6.1481 1.5183 4.7455 6.5454 3.8919 4.9213 4.5529 4.2481 4.8889 1.8240 1.2649 3.2333 1.5453 12.3427 5.1097 5.4105 1.5244 3.3623 6.0472 1.3727 1.3566 5.8794 8.7014 1.3645 3.4448 2.3639 4.9627 4.0186 4.2075 3.8969 3.7535 1.7036 2.7732 2.2182 3.5143 2.3949 2.8389 1.4868 2.0577 2.3462 3.1640 1.7467 1.2576 1.2921 3.1844 1.1536 1.2084 1.2217 1.4805 1.2780 3.7524 1.2134 1.2629 1.2747 1.6024 1.2792 1.3269 1.5368 1.2728 1.6905 5.7899 1.6516 1.2445 3.5943 1.7372 3.5761 1.4592 3.9409 2.4255 2.3316 1.1832 1.0553 8.0776 7.9076 6.6004 7.5954 7.8962 7.8485 9.2710 1.0838 1.0817 1.0852 1.0357 1.0843 1.0860 1.0848 1.1001 1.1003 1.0898 1.0891 1.0887 1.0932 1.0969 1.0964 1.0981 1.0674 1.0639 1.0655 1.0657
irintensity: 0.0795 0.3226 0.1955 1.4459 1.0892 0.2986 0.2362 0.3015 0.7412 0.9377 0.3214 5.0438 4.3305 1.6146 0.8634 1.0666 2.6528 4.1725 1.3799 4.3482 1.2660 0.7613 2.4034 8.2015 8.5907 3.7588 3.1256 0.7588 13.9345 5.6995 0.6625 3.6958 67.9751 36.2925 0.4094 30.4050 8.4248 9.7218 8.2186 160.6116 34.0578 15.4409 22.9758 11.1753 28.4343 17.8485 29.1546 11.1665 40.9908 180.2678 1.6579 6.4268 7.7873 46.0605 14.7796 114.4432 12.2211 5.7529 2.3543 54.0790 2.6740 22.5067 42.7405 19.6876 2.0600 32.8181 55.7404 21.8939 33.9366 93.4422 27.4183 14.0419 41.2194 2.8737 0.7777 16.1768 115.8801 0.2969 13.0781 108.9487 392.2329 42.9172 70.0023 63.4858 81.0760 56.2810 73.4904 139.6657 146.5391 4.0122 3.2786 18.4777 21.0165 14.2384 215.1908 35.1231 4.6874 25.2828 22.7847 25.7172 5.0235 8.2547 23.6937 1.0584 10.1573 5.8158 1.2995 21.6901 1.2929 101.8891 9.9363 21.0027 29.1895 37.3585 2.9158 25.1905 29.7456 6.6530 37.4645 23.6064 75.1695 31.3777 152.1780 28.4078 14.4569 14.1518 27.3654 6.4974 57.1341 114.6161 18.1253 12.6523 197.2628 5.3404 17.8165 41.6246 25.3837 15.6651 38.6792 4.1678 38.6623 14.2172 4.9755 0.4008 1.9600 0.5302 2.7398 3.9543 2.0108 562.6160 30.9802 21.4353 33.2653
temp: 298.150 k
press: 1.00000 atm
elementType: 17 8 8 8 8 8 8 8 8 8 7 6 6 6 6 6 6 6 6 6 6 6 6 6 6 6 6 6 6 6 6 6 6 1 1 1 1 1 1 1 1 1 1 1 1 1 1 1 1 1 1 1 1
symmnumber: 1
zpe: 1020828.8 jmol-1
zpe.correction: 0.388813 hartree
zpe.thermalcorrener: 0.418463 hartree
zpe.thermalcorrenthalpy: 0.419408 hartree
zpe.thermalcorrgfe: 0.324559 hartree
zpe.sumelectzpe: -2039.753309 hartree
zpe.sumelectthermal: -2039.723658 hartree
zpe.sumelectthermalent: -2039.722714 hartree
zpe.sumelectthermalfe: -2039.817563 hartree
dipole: -1.6597 0.9234 1.6918
dipole: 2.5435
quadrupole: -229.3578 -189.6124 -188.9694
quadrupole: 2.0315 -9.4797 -2.6534
quadrupole: -26.7113 13.0341 13.6772 2.0315 -9.4797 -2.6534
hfenergy: -2040.1421217 hartree
pointgroup: C01 [X(C22H20Cl1N1O9)]
dipole: -0.7012107 -0.4475677 -0.5562295 debye
polarizability: 452.0501265|-83.2331824|229.6310332|-40.7151626|-2.6931626|268.8449172 unknown
InChI: InChI=1S/C22H20ClNO9/c1-9(21(30)33-22-17(27)15(25)16(26)18(32-22)20(28)29)11-4-7-14-13(8-11)24-19(31-14)10-2-5-12(23)6-3-10/h2-9,15-18,22,25-28H,1H3
charge 0 multiplicity 1
53 atoms
Cl -9.568346 2.303284 1.688109
O  4.167232 0.537635 -0.964927
O  2.820682 -1.132983 -0.334907
O  6.779454 0.336577 2.318933
O  4.117409 -0.624739 2.632256
O  7.047131 2.462459 0.39494
O  5.063623 3.318891 -2.508887
O  6.330178 1.395989 -2.843946
O  1.997146 -1.956722 1.691583
O  -3.865493 -0.187216 -1.251263
N  -3.325904 -0.737386 0.941895
C  5.649497 0.756169 1.490746
C  4.65422 -0.404305 1.295484
C  6.234569 1.269273 0.173983
C  3.578111 0.009539 0.254847
C  5.069167 1.691242 -0.739645
C  5.571192 2.077746 -2.130182
C  1.136396 -2.833419 -0.458691
C  2.011813 -1.953076 0.431651
C  -0.197404 -2.105055 -0.705617
C  0.946102 -4.232608 0.174182
C  -1.061013 -1.806595 0.376826
C  -0.553046 -1.745091 -2.039733
C  -2.276479 -1.157622 0.086624
C  -2.605065 -0.820367 -1.25863
C  -1.771782 -1.095468 -2.346742
C  -4.232711 -0.179669 0.145829
C  -5.514245 0.420864 0.494719
C  -6.365648 0.972442 -0.50068
C  -5.914621 0.451856 1.859308
C  -7.600976 1.547116 -0.141093
C  -7.146917 1.024108 2.226285
C  -7.973519 1.563738 1.218312
H  5.101529 1.58577 1.990018
H  5.186329 -1.298419 0.905755
H  6.820754 0.46789 -0.320042
H  2.843156 0.712703 0.706678
H  4.522556 2.543081 -0.291106
H  6.40907 -0.032865 3.161986
H  3.304717 -1.213599 2.562586
H  7.72189 2.236018 1.085888
H  1.660827 -2.926764 -1.42525
H  1.91393 -4.755117 0.27572
H  0.493833 -4.155455 1.17684
H  0.284282 -4.84233 -0.464108
H  -0.79744 -2.059932 1.408131
H  0.143297 -1.974949 -2.853513
H  5.420255 3.56701 -3.405358
H  -2.037992 -0.824493 -3.371206
H  -6.058097 0.949306 -1.550034
H  -5.250684 0.024531 2.616885
H  -8.261244 1.973869 -0.901133
H  -7.461125 1.051641 3.273192
