program: Gaussian 09
title: 000188703
version: EM64L-G09RevD.01
frameworkgroup: C1[X(C8H9Cl2O2PS)]
method: RPBEPBE
basis: SDD
operation: Freq
keyword: #p
keyword: freq=noraman
keyword: PBEPBE/SDD
title: #p freq=noraman PBEPBE/SDD
converged: YES YES NO NO
title: Mulliken charges:
elementType: Cl Cl S P O O C C C C C C C C H H H H H H H H H
charge: -0.029459 -0.025291 -0.236596 0.748969 -0.465027 -0.462975 0.550763 -0.838817 -0.199520 -0.231396 -0.225446 -0.226367 -0.212261 -0.479949 0.278499 0.275936 0.287418 0.261105 0.260901 0.241949 0.240874 0.244807 0.241882
chargesum: 0.00000
title: Mulliken charges with hydrogens summed into heavy atoms:
elementType: Cl Cl S P O O C C C C C C C C
charge: -0.029459 -0.025291 -0.236596 0.748969 -0.465027 -0.462975 0.550763 0.003036 -0.199520 -0.231396 0.035659 0.034534 0.029688 0.247615
polarizability: 1.78594564e+02 -1.93502773e+00 1.66393840e+02 1.81199437e+01 -4.90183684e-01 1.12139563e+02
1716.lowfreq: -12.6996 -0.0027 -0.0013 0.0023 0.7155 6.3370 24.2143 52.6254 54.1551
frequency: 23.7687 52.6023 54.0407 80.4712 85.8414 109.1962 154.0396 162.9982 168.4348 175.1749 195.0207 204.5526 221.7863 235.3493 268.4596 319.2359 367.3548 381.7251 389.3933 431.2139 508.1851 510.8175 516.2977 563.4110 626.0008 648.8254 724.0450 737.2043 754.1722 770.7998 832.0739 890.3660 960.6757 962.7626 967.9472 984.5990 1045.4574 1068.1397 1118.3366 1135.8263 1155.1924 1193.5431 1225.1055 1342.4678 1354.8513 1420.3791 1422.8241 1423.1605 1428.5222 1434.9606 1454.8131 1475.2404 1560.1241 1580.9172 2985.6211 3030.0696 3093.4505 3130.1486 3151.6958 3155.2034 3164.7128 3173.2593 3185.3396
redmass: 6.9475 7.9734 8.0776 1.3335 6.7823 2.7790 4.4942 1.0752 5.3167 4.5281 4.7840 4.7766 5.1136 7.9718 8.4107 9.3330 9.0389 7.9909 5.4336 10.1128 5.4003 7.6224 7.0761 4.3508 9.9839 7.2769 4.5979 8.8488 7.6394 1.4091 7.0165 1.3535 2.5817 1.3271 1.3452 2.1817 5.2690 2.4945 1.2462 1.3061 1.3888 1.4445 3.0225 1.1609 8.9498 2.1532 1.1920 3.0678 1.0513 1.0457 1.0499 1.0512 7.0588 7.7140 1.0306 1.0310 1.1028 1.1042 1.1022 1.0871 1.1026 1.0929 1.0998
irintensity: 0.4328 2.8853 0.5952 1.4297 0.4081 1.5226 6.3254 0.5116 3.5364 4.2249 0.0124 3.4790 1.7650 4.4838 5.1354 32.3949 4.1135 2.8376 13.6018 15.6209 0.6100 6.8596 50.4608 9.5605 49.3058 84.0455 22.3111 77.3993 46.8830 56.2643 86.1694 0.0070 157.2657 0.3971 59.5427 41.6755 4.8438 17.0536 0.9625 0.7922 5.4804 8.9007 103.9172 21.2005 5.0722 59.4452 5.6156 104.0950 11.6201 12.5889 12.0885 17.0298 28.8578 2.9404 44.1026 0.7076 14.1961 12.3029 0.9246 2.9705 0.2051 1.0800 6.3275
temp: 298.150 k
press: 1.00000 atm
elementType: 17 17 16 15 8 8 6 6 6 6 6 6 6 6 1 1 1 1 1 1 1 1 1
symmnumber: 1
zpe: 406420.5 jmol-1
zpe.correction: 0.154797 hartree
zpe.thermalcorrener: 0.171193 hartree
zpe.thermalcorrenthalpy: 0.172137 hartree
zpe.thermalcorrgfe: 0.109069 hartree
zpe.sumelectzpe: -2119.049571 hartree
zpe.sumelectthermal: -2119.033176 hartree
zpe.sumelectthermalent: -2119.032231 hartree
zpe.sumelectthermalfe: -2119.095300 hartree
dipole: 0.8943 0.5621 -0.4059
dipole: 1.1316
quadrupole: -92.4061 -105.6327 -117.7891
quadrupole: 0.9207 6.1619 6.4815
quadrupole: 12.8699 -0.3567 -12.5132 0.9207 6.1619 6.4815
hfenergy: -2119.2043688 hartree
pointgroup: C01 [X(C8H9Cl2O2P1S1)]
dipole: 0.3526395 0.2516862 -0.1025656 debye
dipolederiv: -0.1849476 -0.1659959 -0.1069944 -0.1174293 -0.5295151 -0.252898 -0.0659322 -0.2476276 -0.179393 -0.2685654 0.2947198 0.0035203 0.2436587 -0.5590185 -0.030953 0.0208626 -0.0376621 -0.0530767 -0.4305354 0.0084692 -0.0347154 -0.078459 -0.4484334 0.0818272 0.1004464 0.1689392 -0.6166616 2.0510124 -0.0982216 -0.0997309 0.137031 1.382368 -0.1788229 -0.2443614 -0.2645054 1.4832831 -1.7338027 -0.2228815 0.0466021 -0.294938 -0.4266856 0.0818528 -0.1877697 0.0188995 -0.5318257 -0.8090609 0.2854096 0.0613632 0.3682832 -1.0001033 -0.1762004 0.0826922 -0.1795151 -0.6816882 1.0406038 0.2081279 -0.0196491 0.004032 -0.255003 -0.0896485 0.5331845 0.0097494 0.0253062 -0.2729322 -0.0210358 -0.0243289 0.016595 -0.1855961 0.0694604 -0.0207043 -0.0655091 -0.2686126 0.0648889 0.2121733 0.1918933 0.200779 0.7341989 0.4079616 0.081197 0.3409739 0.1802688 0.1771756 -0.4590541 0.0643458 -0.402093 0.7870871 0.0451729 0.0193224 0.0685791 -0.0178365 -0.1097816 -0.1136968 -0.0266911 -0.1023968 -0.1418453 -0.0690199 -0.0425401 -0.0700326 -0.134125 -0.1624034 0.116488 0.0200703 0.1225782 -0.1502182 0.0360107 -0.002449 0.032093 -0.0794655 0.0088628 -0.03356 0.0835191 -0.0274449 0.0646474 0.0562385 0.0692934 0.0524272 -0.0954939 0.2318853 -0.0199695 -0.000854 -0.1391056 0.444517 0.0731112 -0.2724462 0.3434209 0.3176525 0.1088651 0.0787457 0.0245918 0.0810429 0.0378282 -0.0191778 0.0275247 -0.0251105 0.0954023 -0.0214313 -0.0581109 0.0270986 -0.0643493 0.0950558 0.0131984 -0.003201 -0.0037511 0.0804755 0.1265317 -0.0056401 -0.038366 -0.0107865 0.0487441 0.0223206 -0.0252532 0.0583363 -0.0183838 0.0626726 0.0524073 -0.0119707 0.0763554 0.0103041 -0.024312 -0.0201976 -0.0275618 0.1524767 0.086522 -0.0262735 -0.0315536 -0.0396303 0.0019559 -0.0612876 -0.0492697 -0.0568138 0.1350105 -0.0602243 0.0052762 -0.0787664 0.0063957 0.0742022 -0.0247551 -0.0826129 -0.0241396 0.1249959 -0.0706683 0.1138983 -0.014812 0.1121871 0.0181167 -0.0305554 -0.0186984 -0.0243252 0.0905512 0.0426556 -0.1346144 -0.0164316 -0.0555893 -0.0296371 -0.0378691 0.0381698 -0.0521888 0.0562405 0.1226772 -0.0166608 -0.0181407 -0.0367161 0.0270299 0.1083453 0.0627428 -0.0146757 -0.0651006 unknown
polarizability: 179.1013184|-6.5604298|162.9998025|15.8529772|13.3554919|115.0268452 unknown
InChI: InChI=1S/C8H9Cl2O2PS/c1-11-13(2,14)12-8-6(9)4-3-5-7(8)10/h3-5H,1-2H3
charge 0 multiplicity 1
23 atoms
Cl 0.75323 -2.473772 -1.169791
Cl 0.117632 2.885952 0.262385
S  -1.878314 -1.328469 1.705953
P  -2.193389 -0.467363 -0.141111
O  -0.70702 0.207004 -0.943421
O  -3.295835 0.868569 -0.194186
C  0.552436 0.195624 -0.358256
C  -2.860368 -1.424419 -1.570062
C  1.386573 -0.954878 -0.400308
C  1.111691 1.368647 0.21453
C  2.697467 -0.952613 0.107946
C  2.420996 1.402783 0.728013
C  3.211667 0.23361 0.677062
C  -3.406424 1.77902 0.967387
H  -2.163937 -2.243465 -1.797605
H  -3.853372 -1.817687 -1.306691
H  -2.937107 -0.74006 -2.428938
H  3.303695 -1.860843 0.054973
H  2.812307 2.32879 1.157945
H  4.230219 0.248221 1.07607
H  -4.353774 2.31575 0.809796
H  -2.557707 2.482966 0.978282
H  -3.438268 1.204032 1.911426
