program: Gaussian 09
title: 000188701
version: EM64L-G09RevD.01
frameworkgroup: C1[X(C8H9Cl2O2PS)]
method: RPBEPBE
basis: SDD
operation: Freq
keyword: #p
keyword: freq=noraman
keyword: PBEPBE/SDD
title: #p freq=noraman PBEPBE/SDD
converged: YES YES NO NO
title: Mulliken charges:
elementType: Cl Cl S P O O C C C C C C C C H H H H H H H H H
charge: -0.007584 -0.050791 -0.227711 0.742143 -0.487054 -0.474268 0.532574 -0.836925 -0.318096 -0.298800 -0.066382 -0.182404 -0.231160 -0.476474 0.286692 0.271729 0.284740 0.289058 0.262274 0.263426 0.247902 0.234963 0.242149
chargesum: 0.00000
title: Mulliken charges with hydrogens summed into heavy atoms:
elementType: Cl Cl S P O O C C C C C C C C
charge: -0.007584 -0.050791 -0.227711 0.742143 -0.487054 -0.474268 0.532574 0.006236 -0.318096 -0.009742 -0.066382 0.079869 0.032267 0.248539
polarizability: 1.81847210e+02 -1.72601794e+01 1.66020230e+02 7.65476846e+00 1.07456524e+01 1.10935035e+02
1716.lowfreq: -25.1359 -17.4594 -5.3371 -0.0013 0.0005 0.0024 10.2881 17.8877 45.8149
frequency: -16.2153 -4.5081 44.0224 57.4337 90.9546 106.7794 133.9160 148.9212 163.2691 166.1579 186.6796 210.3782 226.9154 276.1254 289.4854 309.4814 330.1964 377.7350 424.9570 444.1419 461.3368 518.8398 548.6219 589.5356 624.3397 628.5397 703.0710 706.0652 757.5072 805.2156 871.7464 886.3222 939.9989 954.5831 971.7745 978.8547 1025.2707 1071.9626 1114.3215 1133.2202 1137.0396 1206.7189 1238.0756 1346.3639 1363.4896 1376.0718 1424.6079 1429.9732 1434.0779 1448.6876 1458.6291 1473.2326 1565.7030 1585.0367 2979.4143 3029.7173 3082.5183 3120.4575 3153.9654 3159.1381 3166.2973 3178.1875 3186.3281
redmass: 5.1031 3.7228 2.8218 1.9727 10.1527 3.3172 5.3887 1.1112 4.8141 5.0700 5.1052 4.2443 4.9341 9.3255 9.3609 23.2342 7.3874 4.8858 6.4265 6.2550 4.1300 7.9759 8.0437 5.8156 7.7713 8.3646 8.4888 4.2990 7.5839 1.3387 4.8292 1.6074 1.3378 3.0586 1.3686 1.8804 7.0475 1.8130 1.2304 1.4824 1.3161 3.3000 1.3200 1.1610 7.6150 4.0626 1.1079 1.0458 1.0453 2.6485 1.0573 1.0527 7.3275 8.4398 1.0303 1.0311 1.1038 1.1036 1.1024 1.1028 1.0890 1.0930 1.0975
irintensity: 0.5215 0.3958 0.0647 0.8258 0.5920 6.9141 1.9802 0.1040 2.1996 3.5126 7.5629 1.1161 4.4125 3.7830 6.7007 0.6106 24.0752 13.2989 14.6320 1.8576 8.9373 33.9484 34.5543 11.4357 87.1539 76.0668 29.3888 0.4502 41.6323 40.0938 148.2593 68.3081 0.2319 142.9112 74.8220 31.2153 60.7151 37.6600 2.1731 13.5472 0.5515 92.6906 1.4990 17.2270 3.3535 47.7537 14.1899 10.8451 12.5169 158.0526 7.0678 10.6847 14.9711 46.4176 44.5021 0.0738 19.3422 17.6230 0.7525 0.5011 0.5017 0.4676 0.9001
temp: 298.150 k
press: 1.00000 atm
elementType: 17 17 16 15 8 8 6 6 6 6 6 6 6 6 1 1 1 1 1 1 1 1 1
symmnumber: 1
zpe: 405668.1 jmol-1
zpe.correction: 0.154511 hartree
zpe.thermalcorrener: 0.169267 hartree
zpe.thermalcorrenthalpy: 0.170212 hartree
zpe.thermalcorrgfe: 0.111557 hartree
zpe.sumelectzpe: -2119.051258 hartree
zpe.sumelectthermal: -2119.036501 hartree
zpe.sumelectthermalent: -2119.035557 hartree
zpe.sumelectthermalfe: -2119.094212 hartree
dipole: -0.4188 -1.2876 -0.9729
dipole: 1.6673
quadrupole: -102.6754 -106.7046 -115.0600
quadrupole: 8.7438 9.7617 -1.3948
quadrupole: 5.4713 1.4421 -6.9134 8.7438 9.7617 -1.3948
hfenergy: -2119.2057688 hartree
pointgroup: C01[X(C8H9Cl2O2P1S1)]
dipole: -0.3735313 -0.2402728 -0.4827506 debye
dipolederiv: -0.0841428 0.0959194 0.012029 0.0613253 -0.6425919 -0.1776375 0.017942 -0.2054602 -0.093637 -0.1726742 0.1306363 0.0306497 0.2379348 -0.7147105 -0.2455362 0.0594115 -0.2277678 -0.1552468 -0.4639187 0.04617 0.0201623 -0.0257895 -0.3802582 0.0576345 0.1775874 -0.0363217 -0.6809269 2.0600667 -0.0309714 -0.1671442 0.3121137 1.3069975 -0.043438 -0.3392344 0.1362417 1.6587853 -1.9978509 0.2102465 0.177952 0.2753695 -0.502173 0.0283445 -0.0145452 0.0929535 -0.5256021 -0.6122826 -0.0914064 -0.0234793 -0.2615612 -1.2101748 -0.0670458 -0.0294515 -0.0409629 -0.6329307 1.2521074 -0.1169191 -0.0495205 -0.6046499 0.0820594 0.0598251 0.4263934 -0.0453619 0.0530799 -0.2600828 0.027905 0.0222803 0.0063166 -0.1843104 -0.0235742 -0.0630885 0.0913157 -0.2618177 -0.206377 -0.1536021 -0.006122 -0.0551049 0.9156767 0.2606714 -0.070016 0.341184 0.0345782 -0.2458507 0.0239296 0.0344236 0.242644 -0.3072307 -0.0726385 0.0688413 -0.0846605 -0.1087738 0.1864001 -0.1967295 0.0131265 -0.3703916 1.049369 0.4124596 -0.0797193 0.3991241 0.1258094 0.0555636 0.006117 0.0431068 -0.0064341 -0.1460985 0.0096222 0.0473719 -0.0246671 -0.049891 -0.0736209 0.007312 0.0609654 0.0698713 -0.2726602 -0.0895329 0.0588453 -0.0696245 -0.1351845 0.2332785 -0.010399 0.0088793 0.1144416 0.6262044 0.0671316 -0.117209 -0.2952143 0.1233319 0.1156149 0.0337139 -0.0162955 0.0364139 0.0835218 0.0195533 0.0127616 -0.0100903 -0.0445549 -0.0392432 -0.0080858 0.0368954 0.0122521 0.1046986 0.0128043 0.0134062 0.0273583 0.091437 0.1167583 -0.0376226 -0.0195426 -0.0453979 -0.0018632 -0.0262016 -0.0257612 -0.0191952 0.0937395 0.0736069 -0.0269109 -0.0662565 -0.0389612 0.0650825 -0.0292293 -0.0747091 -0.0332951 0.1287084 0.0403204 -0.0276136 -0.0498914 -0.0316463 0.0551176 -0.0622852 -0.0686873 -0.0538608 0.1124596 0.0119005 0.0560759 -0.0401868 0.0659771 0.0708491 -0.0143908 -0.038407 -0.0156571 0.1480369 0.0996715 0.0215077 0.0245466 0.0415466 0.0826397 -0.0526884 0.0800799 0.0903494 -0.047049 -0.0734087 0.1310815 0.0240096 0.0696319 -0.0408278 0.0070434 0.0303933 0.0261998 0.0858681 -0.0158364 -0.0903543 -0.0705878 -0.1059017 -0.0393169 -0.0308915 -0.0722053 -0.0425871 0.07978 unknown
polarizability: 165.467717|-19.4850576|171.1307084|5.0060776|27.1393821|122.2040489 unknown
InChI: InChI=1S/C8H9Cl2O2PS/c1-11-13(2,14)12-8-5-6(9)3-4-7(8)10/h3-5H,1-2H3
charge 0 multiplicity 1
23 atoms
Cl 0.985272 2.896559 0.924956
Cl 2.207081 -3.073534 -1.11358
S  -2.461051 0.578878 2.112177
P  -2.433821 0.677103 0.054041
O  -0.87604 1.11913 -0.710933
O  -2.880265 -0.799298 -0.76866
C  0.334591 0.502196 -0.36781
C  -3.446987 1.909834 -0.869584
C  1.321827 1.213261 0.357755
C  0.612529 -0.809041 -0.8249
C  1.860092 -1.382989 -0.529225
C  2.571294 0.623863 0.634141
C  2.850222 -0.689639 0.194347
C  -2.895778 -2.085558 -0.036267
H  -3.309216 1.728483 -1.946338
H  -4.503738 1.783022 -0.592704
H  -3.100648 2.920351 -0.608226
H  -0.139994 -1.336674 -1.417441
H  3.323527 1.185518 1.194993
H  3.815565 -1.154063 0.410647
H  -3.123682 -1.929248 1.034553
H  -1.919731 -2.590205 -0.140017
H  -3.686948 -2.682348 -0.515226
