program: Gaussian 09
title: 000188699
version: EM64L-G09RevD.01
frameworkgroup: C1[X(C19H29NO5)]
method: RPBEPBE
basis: SDD
operation: Freq
keyword: #p
keyword: freq=noraman
keyword: PBEPBE/SDD
title: #p freq=noraman PBEPBE/SDD
converged: YES YES NO NO
title: Mulliken charges:
elementType: O O O O O N C C C C C C C C C C C C C C C C C C C H H H H H H H H H H H H H H H H H H H H H H H H H H H H H
charge: -0.282932 -0.437745 -0.323107 -0.445532 -0.242974 -0.346829 -0.054908 -0.179858 -0.557474 -0.567469 0.057548 0.316558 0.261981 0.266858 -0.434564 -0.139548 -0.423545 -0.385939 -0.300973 -0.237161 -0.725828 -0.677269 -0.691191 0.300003 -0.763382 0.282313 0.276431 0.253481 0.245133 0.247112 0.240640 0.238192 0.214023 0.234384 0.216830 0.256024 0.244605 0.228784 0.238163 0.349964 0.226571 0.202651 0.211823 0.230666 0.224192 0.204393 0.209685 0.224810 0.210668 0.206530 0.349919 0.251799 0.248970 0.246523
chargesum: 0.00000
title: Mulliken charges with hydrogens summed into heavy atoms:
elementType: O O O O O N C C C C C C C C C C C C C C C C C C C
charge: -0.282932 -0.087781 -0.323107 -0.095613 -0.242974 -0.102224 0.227406 0.096573 -0.058860 -0.079717 0.057548 0.316558 0.261981 0.266858 -0.196372 0.074475 0.027670 -0.129915 0.165975 -0.010590 -0.080687 -0.038999 -0.049183 0.300003 -0.016089
polarizability: 2.55107509e+02 -1.19602247e+01 2.26719209e+02 7.51196708e+00 1.45988232e+01 2.02368468e+02
1716.lowfreq: -37.6351 -14.0891 -7.8949 -2.5555 0.0006 0.0007 0.0010 6.8222 9.9290
frequency: -37.6127 -11.9264 9.7694 18.9378 27.9193 33.9343 44.6105 69.8825 70.0684 94.2016 104.4281 117.5134 139.8959 161.8031 170.3684 191.7599 210.4523 220.1455 230.8902 239.7335 245.4292 249.6602 259.3247 278.0737 299.2038 318.7860 330.4314 333.3686 348.2540 366.7836 392.4083 399.3766 419.4590 433.6723 439.3454 465.0443 471.5237 484.5487 499.1417 507.0125 518.9658 554.6264 565.1274 577.2846 616.9595 620.8677 656.9080 702.0407 709.3688 739.2642 755.3288 773.7457 785.9960 824.0823 830.5470 843.5581 866.3945 881.1063 887.1734 900.7352 907.5689 916.1855 920.9009 936.1836 938.9496 962.3759 977.2587 991.3837 996.6739 998.9212 1009.1773 1016.5964 1024.6689 1044.0864 1045.5298 1078.2351 1084.9888 1102.6149 1115.8779 1135.5787 1166.6215 1174.0569 1178.9114 1184.9110 1188.2938 1206.0143 1210.4653 1212.0228 1220.7560 1237.4156 1242.2073 1244.1956 1250.7655 1272.4607 1281.5715 1307.6080 1325.5432 1336.2096 1347.6858 1351.6536 1358.5520 1360.5578 1367.5672 1371.3579 1374.1535 1375.7179 1384.3261 1391.2563 1394.2095 1436.2321 1440.5112 1445.4194 1447.6293 1452.5693 1455.8486 1458.3799 1460.4247 1461.6375 1463.0440 1472.4612 1478.1652 1480.7232 1486.6846 1491.5782 1595.3602 1607.6913 1643.1271 2936.0399 2966.5554 2971.2512 2982.0236 2983.4201 2986.1464 2987.5546 3007.6561 3031.2633 3040.6882 3048.2477 3056.9378 3059.4346 3059.9697 3061.4697 3066.6821 3068.4264 3075.9907 3080.1283 3085.5804 3092.1749 3096.3362 3125.5822 3138.3892 3148.1197 3172.6083 3420.9737 3529.8634 3533.2410
redmass: 1.0605 3.4302 4.5447 3.8893 5.4861 4.9050 4.4344 4.4325 4.4807 3.0248 4.3056 4.3658 4.6773 1.3737 3.2034 3.3847 4.5434 2.2410 3.4043 1.3889 1.1038 1.9551 3.9295 2.9068 2.9880 3.3567 2.4670 2.4183 1.2389 2.3256 2.6040 1.6764 1.5729 2.6140 2.6270 3.3300 2.8947 3.3578 3.5161 3.6775 5.7688 4.3192 4.0129 3.4020 4.1080 4.3926 1.6049 2.9918 3.4926 3.2387 4.3077 1.4957 4.1884 4.1131 3.1050 3.1677 1.8629 1.8766 2.2390 1.9390 3.8560 3.0221 1.6230 2.5502 1.2599 1.4552 2.1195 1.7890 2.3355 1.8367 2.9641 1.4121 1.5386 3.1494 1.6299 2.2138 2.2184 3.6541 1.9406 1.4777 1.1518 1.2650 1.3624 1.8974 2.0092 1.5827 2.4243 1.4150 1.5567 2.0345 2.9170 1.3844 2.1061 2.2132 1.8271 1.2522 1.3364 1.6488 1.3784 1.7058 1.4516 1.4372 1.2190 1.2847 1.2762 1.2626 1.2418 4.0209 1.2190 1.2390 1.1625 1.3057 1.1358 1.1054 1.0674 1.0497 1.0848 1.4371 1.1231 1.0699 1.9770 1.1720 1.1147 1.0607 6.5954 7.2728 10.5616 1.0687 1.0352 1.0366 1.0360 1.0552 1.0647 1.0620 1.0367 1.0853 1.0950 1.0983 1.0940 1.1068 1.0866 1.0986 1.0996 1.0983 1.0980 1.0883 1.1005 1.0996 1.0966 1.0870 1.1015 1.0932 1.0961 1.0739 1.0660 1.0652
irintensity: 1.2380 0.1339 0.0665 0.3151 1.0000 0.7795 0.8035 0.4343 0.5517 1.5235 1.0324 0.7633 2.1174 3.6167 2.7620 6.7265 2.0980 5.5789 6.4354 2.1579 0.4835 2.0972 0.0517 14.3940 1.0195 3.7613 1.4514 5.3086 78.5023 0.4955 30.8091 19.4396 93.4778 28.1119 14.0557 5.2554 7.0219 0.5744 3.7468 21.8974 1.6877 5.6744 6.0053 4.2074 4.5767 4.0816 67.1448 11.9927 6.0802 1.9141 3.0186 54.9288 4.7484 10.0093 5.0747 22.5647 11.0901 6.6206 14.5659 7.7921 31.7533 26.0258 5.9936 19.0903 2.1183 7.9839 54.2391 20.9661 61.8724 49.2277 82.6412 3.9001 45.6569 38.0200 9.5740 36.0339 32.9890 34.6069 10.8371 30.5498 28.1803 26.1980 33.5230 294.3829 99.2514 28.1560 98.1315 10.8957 22.1900 95.1282 70.4947 1.0140 36.3170 8.3137 13.3913 0.2643 5.9268 18.1757 7.4434 3.0721 1.2262 3.9252 25.4446 24.3819 43.0468 25.1447 52.7979 10.6096 15.1781 1.8467 2.3557 135.4050 9.8167 6.8264 13.3110 15.4044 2.7518 8.6940 4.7424 6.8237 17.9340 2.8973 7.1183 17.9032 68.5843 13.1819 221.3987 55.2372 31.9377 44.0492 10.9946 25.7761 14.6510 15.5237 3.1886 22.6569 8.9958 14.9617 19.4374 26.0265 11.3641 4.1030 14.7213 68.7315 71.5364 19.0477 5.5168 67.4739 6.4259 4.3360 9.6425 25.2282 13.4861 1.9418 6.4232 12.2434
temp: 298.150 k
press: 1.00000 atm
elementType: 8 8 8 8 8 7 6 6 6 6 6 6 6 6 6 6 6 6 6 6 6 6 6 6 6 1 1 1 1 1 1 1 1 1 1 1 1 1 1 1 1 1 1 1 1 1 1 1 1 1 1 1 1 1
symmnumber: 1
zpe: 1186805.0 jmol-1
zpe.correction: 0.452030 hartree
zpe.thermalcorrener: 0.477821 hartree
zpe.thermalcorrenthalpy: 0.478765 hartree
zpe.thermalcorrgfe: 0.394211 hartree
zpe.sumelectzpe: -1170.337374 hartree
zpe.sumelectthermal: -1170.311583 hartree
zpe.sumelectthermalent: -1170.310639 hartree
zpe.sumelectthermalfe: -1170.395193 hartree
dipole: 3.5551 0.3971 -4.4629
dipole: 5.7196
quadrupole: -156.4494 -143.7329 -160.4018
quadrupole: 5.2543 10.2815 1.4696
quadrupole: -2.9214 9.7951 -6.8738 5.2543 10.2815 1.4696
hfenergy: -1170.7894042 hartree
pointgroup: C01 [X(C19H29N1O5)]
dipole: 1.0035496 0.3843658 -1.9770847 debye
polarizability: 256.5084623|-7.1833972|222.7288824|-4.9979163|18.6281846|204.9578411 unknown
InChI: InChI=1S/C19H29NO5/c1-12(21)25-18-9-15-13(8-16(18)23)6-5-7-17(15)24-11-14(22)10-20-19(2,3)4/h5-7,14,16,18,20,22-23H,8-11H2,1-4H3
charge 0 multiplicity 1
54 atoms
O  -2.543113 1.69999 0.725335
O  -3.631397 -1.554395 2.291509
O  1.163797 -1.355278 0.335319
O  3.190788 -1.640089 2.226573
O  -3.916653 2.786011 2.273052
N  4.206916 0.569136 -0.663341
C  -2.462022 0.501279 1.631595
C  -3.692477 -0.401616 1.373279
C  -1.142667 -0.207425 1.30576
C  -3.734755 -0.838202 -0.10006
C  -1.203556 -1.140186 0.101879
C  -2.41848 -1.460654 -0.558262
C  0.006955 -1.72014 -0.377817
C  3.906151 1.912117 -1.263142
C  -2.409082 -2.350753 -1.663853
C  3.509305 -1.288769 0.834527
C  3.657217 0.245124 0.671186
C  0.020379 -2.592442 -1.488599
C  2.470078 -1.877501 -0.126226
C  -1.201142 -2.903988 -2.128127
C  4.747826 2.004646 -2.559196
C  2.401399 1.985981 -1.62565
C  4.283216 3.086939 -0.311616
C  -3.30466 2.785717 1.180861
C  -3.257047 3.929064 0.189363
H  -2.483079 0.8612 2.674902
H  -4.612537 0.13044 1.66343
H  -0.359705 0.556872 1.149393
H  -0.82173 -0.778161 2.19958
H  -4.567739 -1.550127 -0.245399
H  -3.953923 0.050997 -0.723402
H  -3.354542 -2.600207 -2.159231
H  4.482224 -1.775892 0.637029
H  4.273663 0.610874 1.521651
H  2.656625 0.701909 0.771169
H  0.954333 -3.027136 -1.854111
H  5.21968 0.383332 -0.701148
H  2.462163 -2.982928 -0.068375
H  2.677682 -1.531999 -1.156524
H  -3.00743 -2.226485 1.911281
H  -1.201533 -3.584991 -2.98612
H  5.831271 1.950398 -2.333711
H  4.560763 2.959806 -3.081253
H  4.493772 1.173956 -3.241329
H  2.133229 1.159709 -2.307392
H  2.173927 2.945877 -2.124152
H  1.755231 1.913807 -0.731911
H  3.71833 3.029071 0.636913
H  4.056678 4.063457 -0.779046
H  5.36308 3.064774 -0.070243
H  2.226575 -1.443511 2.360218
H  -2.751698 3.633172 -0.741129
H  -2.717915 4.779921 0.642781
H  -4.283071 4.271495 -0.027022
