program: Gaussian 09
title: 000188653
version: EM64L-G09RevD.01
frameworkgroup: C1[X(C18H26O2)]
method: RPBEPBE
basis: SDD
operation: Freq
keyword: #pfreq=noraman
keyword: PBEPBE/SDD
title: #p freq=noraman PBEPBE/SDD
converged: YES YES NO NO
title: Mulliken charges:
elementType: O O C C C C C C C C C C C C C C C C C C H H H H H H H H H H H H H H H H H H H H H H H H H H
charge: -0.329559 -0.295344 0.502786 0.336938 -0.048056 -0.589660 -0.547228 -0.508359 -0.181560 -0.809444 -0.730217 -0.728353 -0.415922 0.378741 0.308454 -0.429778 -0.409459 -0.838192 -0.242948 -0.229894 0.211496 0.241956 0.211754 0.207751 0.235228 0.229810 0.242040 0.208480 0.220918 0.225460 0.233030 0.217975 0.227188 0.220950 0.198363 0.208061 0.253756 0.201422 0.189435 0.232210 0.230145 0.226571 0.255482 0.222957 0.227876 0.226741
chargesum: 0.00000
title: Mulliken charges with hydrogens summed into heavy atoms:
elementType: O O C C C C C C C C C C C C C C C C C C
charge: -0.329559 -0.295344 0.502786 0.336938 0.163441 -0.135951 -0.104249 -0.036509 0.026920 -0.130036 -0.064105 -0.068173 -0.025065 0.378741 0.308454 -0.197568 -0.179314 -0.133182 -0.015072 -0.003153
polarizability: 2.46120348e+02 1.37026951e+01 1.85801690e+02 1.06255185e+01 -1.33471688e+01 1.51580413e+02
1716.lowfreq: -2.6698 -0.0007 -0.0004 0.0002 8.4638 13.7883 24.9915 27.5849 45.8308
frequency: 24.9646 26.8904 45.7418 65.5287 85.3785 94.3754 146.4024 150.1539 161.7018 181.1754 183.8002 199.9392 215.0196 228.6279 246.5754 250.9847 287.8243 296.7152 300.9712 325.8815 340.1190 401.4207 409.9557 433.0147 453.0828 484.0966 496.9369 508.1298 529.6029 560.0772 561.7303 597.2877 605.4376 617.7553 727.7782 737.6144 756.0038 768.1178 791.7353 814.1933 833.9216 849.9463 858.3440 876.7312 890.8001 906.6908 918.8149 920.9460 932.5054 948.4057 965.1312 972.7898 979.0744 987.3267 988.3453 989.4112 1011.5583 1026.5316 1047.1738 1048.9543 1052.7378 1070.8234 1106.5064 1120.4265 1123.1293 1146.9486 1169.8699 1173.4651 1173.9679 1184.6817 1190.0357 1200.8351 1209.6478 1219.9989 1234.1805 1240.7833 1259.2251 1264.6324 1291.7152 1300.6228 1305.3840 1323.9800 1337.3185 1355.1559 1377.0785 1377.2612 1381.3399 1388.9674 1395.5440 1395.6892 1437.1525 1450.2880 1458.5937 1465.4636 1467.0102 1469.2387 1472.9193 1473.6645 1479.1150 1483.4715 1485.5845 1486.4325 1491.4803 1495.1951 1591.2269 1617.8448 2931.3596 2958.4885 2968.2680 2970.3583 2975.2839 2980.3487 2981.1150 2987.8817 3005.4279 3013.3484 3029.1494 3051.5588 3064.2148 3068.0294 3070.6547 3073.3790 3075.0490 3085.0249 3088.9144 3089.8028 3096.3325 3102.2499 3115.9760 3120.8816 3138.5135 3160.4773
redmass: 3.7594 3.9472 3.4571 2.9738 3.2561 3.1921 2.9846 1.5053 1.8027 2.8977 1.2520 1.2802 1.8369 2.6817 1.1811 2.0870 2.6514 2.6606 2.5299 2.7282 2.9469 2.6061 2.4124 2.8280 2.8696 3.1658 4.2689 3.5664 3.2903 4.5659 3.6092 3.5542 3.1948 4.4097 3.5437 2.8164 1.8399 2.5227 4.4996 1.9584 2.7387 2.6227 2.3105 1.4746 2.1880 2.3597 2.2905 1.5314 1.7058 1.4579 1.4684 2.8915 1.6797 1.8788 1.5393 1.7450 1.7403 3.4555 2.1828 1.8437 1.7333 2.0456 2.0925 1.7112 2.1023 1.7030 1.6801 1.2636 1.3599 1.8153 1.3547 1.8437 1.8414 1.3377 1.3630 2.2607 1.4967 1.8793 1.3618 1.3010 1.4777 1.6803 1.7693 1.7252 1.4197 1.5978 2.7078 1.3521 1.2381 1.2589 2.1184 1.0923 1.0779 1.0694 1.0605 1.0472 1.0550 1.0601 1.1243 1.0444 1.5104 1.3747 1.2414 1.0643 6.5079 6.3419 1.0560 1.0844 1.0832 1.0395 1.0353 1.0365 1.1046 1.0359 1.0603 1.0592 1.0643 1.0932 1.0999 1.1035 1.0998 1.0989 1.1017 1.0993 1.0997 1.0996 1.0993 1.1035 1.0860 1.0895 1.0934 1.1007
irintensity: 0.1000 0.0168 0.0420 0.0623 0.4103 1.1887 0.2633 0.4052 1.7567 1.4480 1.3424 0.3414 2.1962 6.2837 0.4350 0.1566 0.1933 0.0746 2.5981 1.1606 1.8877 1.2437 1.4755 0.6252 4.9087 6.6695 5.6826 1.8278 5.4561 0.4892 0.1109 4.4695 1.1228 8.5137 1.2497 10.6783 58.7540 16.4457 20.7690 3.1299 9.7756 12.7117 1.7218 4.7090 2.1079 5.1791 19.9044 2.3774 5.1456 4.1198 0.6031 47.1856 4.6780 1.2545 4.2739 8.9694 13.1644 103.6720 84.4885 15.0465 3.8385 19.2189 10.7008 3.7858 15.7108 14.0867 6.5646 6.7989 8.9202 7.5578 2.9313 6.1731 28.5444 14.9759 6.5609 0.7546 0.7918 7.6637 0.1171 28.6851 2.2917 30.1466 3.7525 0.4677 24.5206 5.2863 2.5019 31.6796 5.6317 19.6293 4.9027 7.2837 1.1940 4.7378 11.7673 5.3135 4.7701 8.7826 15.5464 15.0586 13.3927 16.0197 11.8540 13.4904 0.3406 3.3838 47.0301 53.4326 17.2249 26.2432 25.8879 38.2280 31.5296 26.5141 24.1051 43.8724 23.6960 16.7563 12.9302 15.1997 32.5303 78.0841 41.2059 26.1063 18.3395 12.3178 20.8079 41.6492 11.8514 2.8820 32.9184 33.4876
temp: 298.150 k
press: 1.00000 atm
elementType: 8 8 6 6 6 6 6 6 6 6 6 6 6 6 6 6 6 6 6 6 1 1 1 1 1 1 1 1 1 1 1 1 1 1 1 1 1 1 1 1 1 1 1 1 1 1
symmnumber: 1
zpe: 1043531.6 jmol-1
zpe.correction: 0.397460 hartree
zpe.thermalcorrener: 0.417810 hartree
zpe.thermalcorrenthalpy: 0.418754 hartree
zpe.thermalcorrgfe: 0.348350 hartree
zpe.sumelectzpe: -850.413033 hartree
zpe.sumelectthermal: -850.392683 hartree
zpe.sumelectthermalent: -850.391739 hartree
zpe.sumelectthermalfe: -850.462143 hartree
dipole: 0.9205 -1.4065 -0.7651
dipole: 1.8468
quadrupole: -122.4681 -118.3309 -119.2701
quadrupole: 5.0618 0.2165 -2.9477
quadrupole: -2.4451 1.6921 0.7529 5.0618 0.2165 -2.9477
hfenergy: -850.8104936 hartree
pointgroup: C01[X(C18H26O2)]
dipole: -0.3839373 0.5516777 -0.2760447 debye
polarizability: 244.9024773|16.4133957|185.7561351|-11.0029417|14.2654721|152.8438381 unknown
InChI: InChI=1S/C18H26O2/c1-13(2)18-10-9-17(4,20-18)16(11-18)19-12-15-8-6-5-7-14(15)3/h5-8,13,16H,9-12H2,1-4H3
charge 0 multiplicity 1
46 atoms
O  3.063446 -1.123806 -0.197203
O  -0.547186 -0.644318 -0.204488
C  2.831622 0.366484 -0.09257
C  1.706079 -1.543855 0.279651
C  0.801004 -0.805885 -0.761237
C  1.580092 0.531888 -1.011142
C  2.376369 0.517945 1.393838
C  1.59428 -0.815817 1.650108
C  4.096287 1.112973 -0.550346
C  1.589747 -3.057731 0.293265
C  3.885965 2.64625 -0.493498
C  5.35738 0.691831 0.23981
C  -1.536848 -0.226987 -1.225632
C  -2.885793 -0.059969 -0.561219
C  -3.148493 1.049677 0.298793
C  -3.900394 -1.018289 -0.797571
C  -4.428072 1.154226 0.897619
C  -2.086563 2.100168 0.573843
C  -5.174059 -0.899902 -0.197884
C  -5.43731 0.193998 0.655369
H  0.743678 -1.409809 -1.692125
H  1.891415 0.63343 -2.065976
H  0.964654 1.407686 -0.736511
H  1.743917 1.411234 1.54061
H  3.248144 0.602754 2.064007
H  2.084056 -1.423901 2.429769
H  0.542118 -0.652669 1.933124
H  4.254456 0.825513 -1.611338
H  1.804245 -3.477256 -0.705954
H  2.300381 -3.498583 1.013999
H  0.565957 -3.352516 0.584405
H  4.78186 3.169735 -0.87435
H  3.022024 2.968092 -1.103693
H  3.717448 2.985074 0.546099
H  5.314379 1.039162 1.289325
H  6.260653 1.135278 -0.218717
H  5.465067 -0.405963 0.24291
H  -1.587332 -1.000175 -2.021776
H  -1.198972 0.72509 -1.69056
H  -3.685576 -1.870611 -1.454004
H  -4.636022 2.001433 1.562398
H  -2.425333 2.817465 1.34052
H  -1.150243 1.627542 0.920792
H  -1.84142 2.678588 -0.339225
H  -5.947404 -1.651249 -0.391613
H  -6.419199 0.299875 1.13058
