program: Gaussian 09
title: 000188644
version: EM64L-G09RevD.01
frameworkgroup: C1[X(C17H17ClO4S)]
method: RPBEPBE
basis: SDD
operation: Freq
keyword: #p
keyword: freq=noraman
keyword: PBEPBE/SDD
title: #p freq=noraman PBEPBE/SDD
converged: YES YES NO NO
title: Mulliken charges:
elementType: Cl S O O O O C C C C C C C C C C C C C C C C C H H H H H H H H H H H H H H H H H
charge: -0.061627 0.194111 -0.290327 -0.241701 -0.241793 -0.313818 0.025608 0.388417 -0.400210 0.470082 -0.421581 -0.340014 -0.389481 -0.323139 -0.254780 -0.686682 -0.510505 0.403502 -0.335958 -0.354423 -0.204190 -0.189292 -0.118783 0.228728 0.305597 0.229109 0.238025 0.258629 0.254981 0.228134 0.212949 0.218188 0.243430 0.223931 0.266152 0.267593 0.253264 0.254762 0.254306 0.258806
chargesum: 0.00000
title: Mulliken charges with hydrogens summed into heavy atoms:
elementType: Cl S O O O O C C C C C C C C C C C C C C C C C
charge: -0.061627 0.194111 -0.290327 -0.241701 -0.241793 -0.313818 0.254335 0.388417 -0.400210 0.470082 -0.115984 0.127119 -0.130852 -0.068158 0.186302 -0.001133 0.023240 0.403502 -0.082694 -0.099661 0.050116 0.069514 -0.118783
polarizability: 2.80201744e+02 1.77832550e+01 2.63831262e+02 8.21903446e+00 -1.30499564e+01 1.32693874e+02
1716.lowfreq: -4.4501 -0.0017 0.0005 0.0020 3.3071 5.2297 16.1413 22.1389 26.5464
frequency: 16.1194 22.0587 26.5144 40.5664 47.0817 64.4378 92.3660 106.4255 123.7041 129.3080 153.1881 165.5042 189.9468 195.9940 213.1274 257.5713 264.9323 300.0202 311.7984 318.5945 344.0947 359.1512 387.4525 415.0418 422.1655 433.2562 443.7627 473.8015 495.7930 497.3205 499.7288 526.6840 562.3280 576.3912 620.1813 639.4891 656.2899 676.8012 696.2832 711.9714 744.1746 767.1970 788.4210 797.7211 803.5784 815.3623 822.3909 883.8912 891.2152 899.8529 918.8695 922.3065 929.9933 935.7647 951.5611 960.6607 990.3351 1017.2626 1022.8943 1035.5283 1058.8325 1073.2629 1074.0455 1102.7592 1113.3721 1116.5735 1150.4979 1161.4841 1171.7382 1177.0889 1211.6805 1216.7068 1220.5574 1266.9773 1275.3127 1291.7447 1305.2707 1317.2952 1350.8918 1360.3809 1362.0474 1368.5630 1379.2462 1392.2041 1404.6991 1407.9187 1448.0204 1454.6750 1458.2272 1459.8300 1463.4692 1469.2550 1476.5417 1586.1356 1589.8625 1602.0903 1604.0998 2959.1933 3006.4665 3010.2632 3015.3795 3020.2995 3033.7530 3079.3237 3109.9593 3118.8062 3145.1580 3150.6959 3155.7659 3159.5158 3164.1165 3176.3876 3179.9821 3183.6720
redmass: 7.9575 6.1679 6.0384 4.3451 7.0363 6.2962 3.9344 7.1129 3.6639 4.9303 4.9033 4.5106 4.1723 1.2607 3.5190 3.7931 4.6149 5.0771 3.6329 6.9045 5.8436 7.0067 3.6831 3.0061 4.9655 3.4426 5.1617 5.5208 4.4660 5.2157 2.7710 3.5359 6.2531 4.1917 6.5974 5.7101 5.6420 5.8781 3.5099 4.9620 5.3236 3.9898 2.7857 3.4537 1.3976 1.4702 1.5559 6.5026 1.7940 2.1124 2.0339 1.6859 1.4664 1.3530 1.3519 3.8028 3.9410 3.1915 2.6769 2.5187 2.5662 2.5903 1.8326 2.5520 1.3056 1.2779 2.1799 1.2002 1.8665 1.2160 2.0614 1.7053 3.8911 1.1419 1.3111 1.2659 1.3642 1.2104 1.2538 1.4210 1.9203 4.5697 2.4467 1.2855 3.6381 4.7620 1.2369 1.1713 1.0444 1.1009 1.1455 1.7202 2.0410 7.4303 7.8057 7.2119 6.6330 1.0570 1.0367 1.0651 1.0833 1.0605 1.1000 1.1054 1.1003 1.1005 1.1076 1.0932 1.0891 1.0881 1.0885 1.0966 1.0971 1.0973
irintensity: 0.3583 0.2844 0.6426 0.0253 0.2254 1.3263 1.1688 0.8109 5.0397 6.5369 10.2477 5.1916 0.6195 0.1668 0.3101 1.9093 2.4432 2.5327 6.5477 1.9694 4.7962 3.4995 0.7281 0.0959 1.6874 4.1977 0.4604 1.0489 7.1419 1.7381 25.6999 1.5222 0.5057 7.3113 4.7826 53.9515 38.1740 2.9891 0.6602 0.8589 8.4951 4.7263 69.0530 98.9641 19.7451 51.1006 66.7261 145.0378 15.8063 44.7476 28.6370 29.3077 9.8878 0.4422 1.4655 46.1472 38.6414 10.6489 15.4488 74.9514 64.7661 50.1423 126.0720 81.7452 5.6292 4.8178 1.7228 14.8865 159.7962 43.9001 134.2998 69.2603 38.6611 22.6220 0.5909 0.9185 15.5287 11.6974 13.7545 7.4122 0.4284 3.5600 7.2553 38.1441 0.9891 12.4787 51.2850 79.3250 16.1406 26.2689 31.7846 133.9905 154.8169 7.6136 15.5305 27.6548 18.1542 38.8423 13.3918 26.6969 12.4343 70.9437 40.2616 22.1443 22.3901 17.4520 11.6161 32.1603 2.7905 4.9105 3.7788 5.6885 1.8692 4.7258
temp: 298.150 k
press: 1.00000 atm
elementType: 17 16 8 8 8 8 6 6 6 6 6 6 6 6 6 6 6 6 6 6 6 6 6 1 1 1 1 1 1 1 1 1 1 1 1 1 1 1 1 1
symmnumber: 1
zpe: 795446.8 jmol-1
zpe.correction: 0.302970 hartree
zpe.thermalcorrener: 0.324970 hartree
zpe.thermalcorrenthalpy: 0.325914 hartree
zpe.thermalcorrgfe: 0.248589 hartree
zpe.sumelectzpe: -1815.290592 hartree
zpe.sumelectthermal: -1815.268592 hartree
zpe.sumelectthermalent: -1815.267648 hartree
zpe.sumelectthermalfe: -1815.344973 hartree
dipole: -0.3191 0.7454 -0.2302
dipole: 0.8429
quadrupole: -162.4263 -140.4359 -145.2441
quadrupole: -12.3388 9.8126 -7.5413
quadrupole: -13.0575 8.9329 4.1247 -12.3388 9.8126 -7.5413
hfenergy: -1815.5935622 hartree
pointgroup: C01 [X(C17H17Cl1O4S1)]
dipole: -0.1927063 0.2510228 -0.0990829 debye
polarizability: 272.7867486|18.4265814|268.4358477|-2.6398017|-25.6024637|135.5042841 unknown
InChI: InChI=1S/C17H17ClO4S/c1-12(19-8-9-20-14-4-2-13(18)3-5-14)22-15-6-7-16-17(10-15)23-11-21-16/h2-7,10,12H,8-9,11H2,1H3
charge 0 multiplicity 1
40 atoms
Cl -5.795198 -3.05283 1.500657
S  1.620632 -2.883793 -0.279155
O  2.159585 2.488602 -0.090985
O  -0.019486 3.414997 -0.450399
O  4.363141 -2.688441 -0.217436
O  -1.452805 0.689778 -0.38043
C  0.843986 2.799371 0.535743
C  2.654057 1.163773 -0.081063
C  2.443108 -1.247153 -0.147513
C  3.851975 -1.368094 -0.129718
C  1.820662 0.011555 -0.133042
C  -0.448488 2.563227 -1.569343
C  4.064228 1.041988 -0.066801
C  4.675484 -0.232607 -0.099589
C  -1.752218 1.821877 -1.27854
C  1.073895 3.842139 1.620154
C  3.329649 -3.65198 0.160236
C  -2.520962 -0.13647 0.017165
C  -3.873473 0.084832 -0.341183
C  -2.166667 -1.246598 0.824177
C  -4.871757 -0.80779 0.114503
C  -3.161252 -2.134487 1.277223
C  -4.504944 -1.902164 0.916067
H  0.402563 1.86137 0.923786
H  0.731281 0.095854 -0.182994
H  -0.625502 3.263864 -2.404231
H  0.353722 1.862581 -1.866589
H  4.66772 1.952755 -0.025617
H  5.763239 -0.34181 -0.092386
H  -2.472886 2.509002 -0.792531
H  -2.189673 1.436106 -2.223453
H  1.746558 3.43846 2.395092
H  1.537375 4.737453 1.174484
H  0.115105 4.12809 2.085043
H  3.481872 -4.569413 -0.423413
H  3.355578 -3.82766 1.249573
H  -4.1691 0.933411 -0.963653
H  -1.116608 -1.411442 1.084683
H  -5.919068 -0.645473 -0.155883
H  -2.893029 -2.993677 1.898262
