program: Gaussian 09
title: 000188642
version: EM64L-G09RevD.01
frameworkgroup: C1[X(C10H18O3)]
method: RPBEPBE
basis: SDD
operation: Freq
keyword: #pfreq=noraman
keyword: PBEPBE/SDD
title: #p freq=noraman PBEPBE/SDD
converged: NO YES NO NO
title: Mulliken charges:
elementType: O O O C C C C C C C C C C H H H H H H H H H H H H H H H H H H
charge: -0.309015 -0.447498 -0.460567 0.192702 0.339699 0.377571 -0.581930 -0.135041 -0.519611 -0.480877 -0.760297 -0.789981 -0.745881 0.234558 0.223036 0.219782 0.245920 0.233296 0.230973 0.225450 0.236679 0.221237 0.220915 0.247493 0.208159 0.225100 0.233761 0.226109 0.218435 0.331067 0.338755
chargesum: 0.00000
title: Mulliken charges with hydrogens summed into heavy atoms:
elementType: O O O C C C C C C C C C C
charge: -0.309015 -0.116431 -0.121812 0.192702 0.339699 0.377571 -0.124336 0.084741 -0.040395 -0.024454 -0.081466 -0.109229 -0.067576
polarizability: 1.25692760e+02 5.38239351e-01 1.06804993e+02 -2.45772160e+00 2.43014380e+00 1.04436992e+02
1716.lowfreq: -6.5249 -0.0007 -0.0003 -0.0003 8.9405 22.8415 63.7022 140.5711 183.4733
frequency: 63.4791 140.5228 183.4652 202.8763 218.2008 227.2471 229.8094 239.4186 253.2767 264.0181 280.3603 297.6581 326.7126 344.6285 374.0976 412.3090 419.8367 448.0756 465.7138 476.5051 511.4271 537.5600 564.7469 638.7676 648.7603 753.3454 782.5049 820.6184 862.8841 892.9211 911.0319 920.4319 929.6600 967.0571 975.1846 981.9238 1012.6460 1039.1533 1049.0810 1061.2491 1084.0601 1101.6289 1135.2682 1147.7929 1171.3372 1181.4437 1197.6940 1220.3699 1240.8190 1245.8063 1266.2042 1283.2566 1302.6970 1314.5004 1331.1002 1347.8335 1372.9742 1376.6254 1384.9440 1388.7436 1446.9288 1454.2120 1456.5527 1466.7087 1470.1290 1474.0788 1476.8458 1483.3362 1503.3877 2976.2854 2985.6379 2993.0365 2993.3455 2999.0592 3011.3236 3024.0358 3055.9203 3070.0449 3079.7976 3087.2419 3089.2150 3090.3083 3094.2881 3104.5597 3105.7595 3543.7759 3566.7266
redmass: 3.6396 2.2821 1.2735 1.0355 1.1829 1.8900 2.6182 1.1372 3.6191 2.8557 3.7465 2.4960 1.7528 1.4627 2.4766 3.2857 3.0653 2.6521 5.8842 3.2403 2.9299 4.2495 3.3582 3.7278 3.5930 2.7581 2.8176 1.5671 2.5756 2.4209 2.3620 1.4890 2.6120 2.1086 1.8656 1.3746 2.2799 2.5759 3.0582 1.6918 2.2468 1.9620 1.5732 1.8090 2.4525 1.4794 2.2813 1.8779 1.8240 1.3477 1.5233 1.8316 1.4341 1.5838 1.5745 1.8679 1.2862 1.6582 1.2392 1.2368 1.0706 1.0724 1.0605 1.0573 1.0617 1.0546 1.0667 1.0616 1.0761 1.0819 1.0371 1.0359 1.0367 1.0622 1.0606 1.0638 1.1027 1.1001 1.0980 1.1008 1.1005 1.1007 1.0984 1.0994 1.0985 1.0657 1.0666
irintensity: 0.7126 2.3708 0.4033 0.4571 2.6421 8.0360 10.1243 120.1723 3.3849 8.2688 1.4498 2.3623 56.8341 87.4190 3.1479 6.2944 7.6541 2.3626 5.6770 2.7170 1.2983 1.3094 3.1422 2.3542 0.2568 7.5248 1.5695 4.5218 29.9002 1.8960 68.3569 4.6567 2.7117 60.4385 1.6753 9.7047 34.3641 37.7966 61.5990 43.1537 34.4898 28.2520 17.8868 12.7634 15.8921 13.0880 37.0622 13.6135 21.0575 6.2271 17.4383 3.2770 0.8705 17.3457 6.0713 7.5423 22.2835 8.7119 21.9936 30.4454 2.5384 1.6812 4.2087 13.1332 12.7546 10.2435 17.3457 14.5285 3.0498 32.9396 15.5550 25.3875 23.5722 48.0644 30.5022 22.8064 24.0749 2.4009 11.8811 27.6398 12.1749 42.7854 38.2922 27.3955 20.7026 3.3203 2.4048
temp: 298.150 k
press: 1.00000 atm
elementType: 8 8 8 6 6 6 6 6 6 6 6 6 6 1 1 1 1 1 1 1 1 1 1 1 1 1 1 1 1 1 1
symmnumber: 1
zpe: 699377.6 jmol-1
zpe.correction: 0.266379 hartree
zpe.thermalcorrener: 0.280118 hartree
zpe.thermalcorrenthalpy: 0.281062 hartree
zpe.thermalcorrgfe: 0.228523 hartree
zpe.sumelectzpe: -616.467726 hartree
zpe.sumelectthermal: -616.453987 hartree
zpe.sumelectthermalent: -616.453043 hartree
zpe.sumelectthermalfe: -616.505581 hartree
dipole: 0.0242 -1.2627 -1.9966
dipole: 2.3625
quadrupole: -79.9094 -80.4091 -76.5173
quadrupole: 3.4920 -1.1520 7.4604
quadrupole: -0.9641 -1.4638 2.4280 3.4920 -1.1520 7.4604
hfenergy: -616.7341046 hartree
pointgroup: C01 [X(C10H18O3)]
dipole: -0.0201051 0.4834468 0.7936062 debye
polarizability: 125.3797011|-1.0248768|106.7497711|3.492068|2.3785523|104.8052734 unknown
InChI: InChI=1S/C10H18O3/c1-8(2)10(12)5-4-9(3,13-8)7(11)6-10/h7,11-12H,4-6H2,1-3H3
charge 0 multiplicity 1
31 atoms
O  -0.037435 -1.357399 0.494725
O  2.115605 1.682172 -0.210619
O  -2.59325 1.327267 0.22155
C  0.910598 0.840791 -0.131182
C  -1.216183 -0.651368 -0.101511
C  1.267523 -0.622631 0.324714
C  -0.142689 1.448121 0.831689
C  -1.448298 0.593244 0.798332
C  0.289027 0.815786 -1.542948
C  -0.893684 -0.201006 -1.546726
C  -2.36842 -1.65208 -0.025851
C  1.961028 -0.682203 1.701505
C  2.128743 -1.377041 -0.709971
H  -0.361737 2.472338 0.476103
H  0.255217 1.525932 1.860781
H  -1.703602 0.235974 1.817256
H  1.063413 0.553765 -2.282754
H  -0.059408 1.835521 -1.783304
H  -1.79814 0.253284 -1.985369
H  -0.648428 -1.102299 -2.137413
H  -3.313917 -1.159106 -0.307993
H  -2.185218 -2.503026 -0.704729
H  -2.464566 -2.047028 1.001034
H  1.990753 -1.734651 2.032551
H  3.003976 -0.319213 1.641608
H  1.419551 -0.110647 2.474716
H  1.576932 -1.550868 -1.647546
H  3.045279 -0.803701 -0.939516
H  2.415784 -2.362619 -0.303178
H  2.456398 1.835235 0.708079
H  -2.850651 2.057859 0.837968
