program: Gaussian 09
title: 000017368
version: EM64L-G09RevD.01
frameworkgroup: C1[X(C14H28N2S4)]
method: RPBEPBE
basis: SDD
operation: Freq
keyword: #p
keyword: freq=noraman
keyword: PBEPBE/SDD
title: #p freq=noraman PBEPBE/SDD
converged: YES YES NO NO
title: Mulliken charges:
elementType: S S S S N N C C C C C C C C C C C C C C H H H H H H H H H H H H H H H H H H H H H H H H H H H H
charge: 0.047010 0.081283 0.029600 0.052971 0.045429 0.057051 -0.401901 -0.373197 -0.389558 -0.383105 -0.327553 -0.330812 -0.333463 -0.327450 -0.473462 -0.502819 -0.675919 -0.678148 -0.677433 -0.679991 0.243220 0.226200 0.253715 0.208512 0.215671 0.282726 0.208316 0.251301 0.248862 0.198707 0.240890 0.192824 0.200538 0.223038 0.194921 0.245154 0.204359 0.219944 0.228604 0.205217 0.220849 0.224298 0.224273 0.207342 0.223521 0.220539 0.204169 0.223758
chargesum: 0.00000
title: Mulliken charges with hydrogens summed into heavy atoms:
elementType: S S S S N N C C C C C C C C C C C C C C
charge: 0.047010 0.081283 0.029600 0.052971 0.045429 0.057051 0.067519 0.089030 0.108839 0.076512 0.120016 0.102901 0.090113 0.112625 -0.473462 -0.502819 -0.023012 -0.027784 -0.022297 -0.031525
polarizability: 3.10784754e+02 2.08883679e+01 2.40510932e+02 3.89133847e+00 4.38650570e+00 1.99129069e+02
1716.lowfreq: -9.0678 -7.4854 -4.8118 -0.0030 -0.0018 0.0015 10.0512 12.7390 20.8369
frequency: 8.6585 10.4181 20.7536 39.1847 43.4039 46.6956 54.8647 57.5732 66.4292 76.8942 91.0432 97.2619 100.8680 107.4409 108.6340 138.6108 160.8728 198.9747 211.8901 217.2427 226.7829 228.5803 239.7231 242.0779 269.7122 275.6968 277.7706 279.7554 280.8356 327.1318 334.6880 344.7027 357.3470 405.3397 406.9021 468.3380 490.9922 506.3191 553.8870 558.9354 609.0781 613.0203 741.7306 742.6456 745.0749 748.7558 823.9595 824.3642 864.7217 866.7638 871.9440 873.8130 886.6526 889.2281 901.1234 902.2160 960.9803 966.3243 1046.7464 1047.4854 1048.4921 1049.2095 1077.3552 1079.0801 1102.3430 1102.9745 1109.7746 1110.3886 1154.4712 1155.6179 1185.4457 1189.2898 1237.9173 1239.0996 1261.9395 1262.9425 1292.2867 1292.7111 1293.8608 1294.2399 1300.7022 1302.5346 1304.6883 1304.9101 1350.3640 1353.6078 1354.4596 1357.9100 1389.8019 1390.6882 1390.9745 1392.9708 1418.8246 1420.3048 1453.7005 1457.4284 1471.4073 1471.5170 1472.1379 1474.7308 1476.3475 1478.2966 1479.4594 1479.9096 1482.8444 1483.0317 1484.5431 1484.9439 1494.2740 1501.1456 2975.5342 2976.0692 2977.1542 2977.3152 2978.1121 2982.7058 2986.5776 2986.6026 2993.5426 2994.0800 2995.3809 2996.6224 3024.8787 3033.4624 3042.8589 3044.7130 3054.0370 3060.5201 3062.8881 3063.5036 3075.1727 3077.5796 3079.7021 3080.0140 3081.8413 3082.0094 3083.0568 3084.4164
redmass: 4.6862 4.1728 4.6184 5.2650 3.3476 4.2257 3.8313 5.2337 4.1406 1.7933 2.0757 3.1814 2.2561 1.7833 2.0327 12.3845 6.6253 2.8590 1.1839 1.2865 1.4034 1.1703 2.9615 2.8530 4.9404 2.7225 3.3565 4.6913 3.6847 5.5284 4.6130 4.2216 3.8440 3.8213 3.7663 18.0565 5.0124 4.7775 4.9651 5.3354 5.2949 5.0092 1.0969 1.0956 1.0920 1.0870 3.1435 2.9993 1.3863 1.2706 1.4332 1.5348 1.6051 1.5402 2.1226 2.2224 3.4346 3.7602 3.0079 3.0136 2.9557 2.9151 2.1126 1.9877 2.1224 2.1271 2.2186 2.2141 1.9507 1.9601 2.5074 2.5322 1.4172 1.3996 1.3230 1.3627 1.1849 1.1839 1.1594 1.1500 1.2605 1.2815 1.2476 1.2515 1.4040 1.3429 1.3955 1.3725 1.2092 1.2074 1.2090 1.2069 1.8367 1.7553 1.1531 1.1796 1.0677 1.0632 1.0885 1.0659 1.0439 1.0437 1.0487 1.0492 1.1172 1.0840 1.0859 1.1073 1.2510 1.2409 1.0361 1.0361 1.0463 1.0370 1.0490 1.0605 1.0619 1.0602 1.0632 1.0609 1.0619 1.0599 1.1007 1.0995 1.0965 1.0964 1.1024 1.1035 1.1025 1.1021 1.1018 1.1023 1.0999 1.1013 1.1024 1.1012 1.0995 1.0990
irintensity: 1.5993 0.4869 1.8556 0.4528 0.1558 0.3124 0.4616 0.3932 1.2902 0.0078 0.2414 0.5360 0.2598 0.1401 0.6647 0.2145 1.8036 1.8047 0.4358 0.5856 0.7064 0.2382 0.6003 0.3415 0.5955 5.0744 1.9974 1.4001 1.8374 4.4295 7.0133 15.8231 5.1165 2.1653 19.2000 1.6756 6.9980 13.4826 1.3392 6.2241 3.0872 1.8559 5.5075 3.4781 16.2454 16.3876 28.7182 22.0925 23.7504 3.4690 22.9331 17.5225 11.3501 15.3934 20.5627 14.0084 85.3166 45.3170 3.1729 4.1662 0.4859 3.4489 42.3203 31.6044 13.0495 7.5995 5.1465 3.3879 16.5196 47.0233 34.1404 36.7582 18.4482 70.4408 12.0885 9.2058 16.5041 3.7189 28.1218 3.3126 1.7611 0.7772 3.0749 3.1619 13.6339 0.6158 10.5055 14.1495 14.0577 18.5563 10.6389 14.7859 87.6111 133.4297 17.0800 29.1941 0.9556 3.5354 11.4353 1.7616 15.1272 14.5453 16.1502 17.0096 5.6757 5.0061 36.1179 36.0710 39.5409 81.3203 42.8514 36.3495 44.5735 27.1919 8.9133 1.9765 21.0279 12.3173 46.2046 32.5005 48.3866 40.8672 19.5697 14.2697 0.9347 1.6552 6.5582 0.6378 2.8650 3.7961 59.0818 57.7044 35.6053 61.9666 49.6992 55.0070 41.3825 34.3197
temp: 298.150 k
press: 1.00000 atm
elementType: 16 16 16 16 7 7 6 6 6 6 6 6 6 6 6 6 6 6 6 6 1 1 1 1 1 1 1 1 1 1 1 1 1 1 1 1 1 1 1 1 1 1 1 1 1 1 1 1
symmnumber: 1
zpe: 1058265.1 jmol-1
zpe.correction: 0.403072 hartree
zpe.thermalcorrener: 0.430504 hartree
zpe.thermalcorrenthalpy: 0.431448 hartree
zpe.thermalcorrgfe: 0.339454 hartree
zpe.sumelectzpe: -2250.411849 hartree
zpe.sumelectthermal: -2250.384417 hartree
zpe.sumelectthermalent: -2250.383473 hartree
zpe.sumelectthermalfe: -2250.475467 hartree
dipole: -1.3980 1.6344 1.7255
dipole: 2.7573
quadrupole: -116.2432 -160.2559 -155.1765
quadrupole: 9.0771 1.1483 -2.1760
quadrupole: 27.6487 -16.3640 -11.2847 9.0771 1.1483 -2.1760
hfenergy: -2250.8149211 hartree
pointgroup: C01 [X(C14H28N2S4)]
dipole: -0.4409782 -0.772799 -0.6206106 debye
polarizability: 310.9973937|-17.3455498|238.9335187|13.6257936|-4.8490511|200.4938422 unknown
InChI: InChI=1S/C14H28N2S4/c1-5-9-15(10-6-2)13(17)19-20-14(18)16(11-7-3)12-8-4/h5-12H2,1-4H3
charge 0 multiplicity 1
48 atoms
S  -1.360051 0.597561 1.805344
S  0.691342 0.055237 2.449053
S  -0.672427 -2.021359 0.138155
S  1.318971 2.267471 0.28873
N  -3.022704 -0.629756 0.034007
N  2.842988 0.040735 0.770853
C  -3.9378 0.485831 0.40372
C  -3.534886 -1.57699 -0.995281
C  3.053912 -1.347092 1.274684
C  3.896397 0.564184 -0.143542
C  -3.747318 1.743539 -0.477869
C  -4.215108 -2.816173 -0.370822
C  3.793682 -1.401645 2.63103
C  3.632757 0.19798 -1.62232
C  -1.767385 -0.789766 0.552596
C  1.73252 0.797353 1.024511
C  -4.721736 2.868853 -0.07003
C  -4.755158 -3.769106 -1.458368
C  4.072249 -2.857598 3.060805
C  4.750374 0.736486 -2.540192
H  -3.796321 0.742351 1.471291
H  -4.972788 0.106937 0.307363
H  -2.683815 -1.89498 -1.623121
H  -4.252266 -1.021371 -1.629228
H  3.646191 -1.878715 0.506149
H  2.070851 -1.847334 1.34352
H  4.865233 0.146646 0.192842
H  3.926224 1.662938 -0.034224
H  -2.702621 2.09364 -0.38624
H  -3.906007 1.471321 -1.53979
H  -3.473717 -3.339552 0.260139
H  -5.040608 -2.491022 0.293068
H  4.744776 -0.837515 2.559411
H  3.180338 -0.894444 3.401057
H  3.553301 -0.902119 -1.725344
H  2.657176 0.62524 -1.916309
H  -5.776558 2.547436 -0.164229
H  -4.553358 3.181632 0.977285
H  -4.582035 3.757757 -0.71001
H  -5.505053 -3.268364 -2.099983
H  -3.937849 -4.130126 -2.109841
H  -5.237497 -4.652742 -1.003897
H  3.1314 -3.42942 3.161803
H  4.708246 -3.380001 2.321205
H  4.592477 -2.889364 4.034535
H  4.817127 1.838599 -2.478814
H  5.738369 0.320352 -2.264996
H  4.555268 0.470477 -3.594408
