program: Gaussian 09
title: 000188583
version: EM64L-G09RevD.01
frameworkgroup: C1[X(C9H10O2)]
method: RPBEPBE
basis: SDD
operation: Freq
keyword: #pfreq=noraman
keyword: PBEPBE/SDD
title: #p freq=noraman PBEPBE/SDD
converged: YES YES NO NO
title: Mulliken charges:
elementType: O O C C C C C C C C C H H H H H H H H H H
charge: -0.302753 -0.438792 -0.221848 -0.080362 0.385337 -0.374491 -0.402096 -0.376305 -0.222768 -0.225516 -0.235490 0.236257 0.246202 0.224953 0.231567 0.238453 0.275487 0.230067 0.231091 0.348803 0.232201
chargesum: 0.00000
title: Mulliken charges with hydrogens summed into heavy atoms:
elementType: O O C C C C C C C C C
charge: -0.302753 -0.089988 0.014410 0.165841 0.385337 0.082029 -0.163642 -0.100818 0.007299 0.005575 -0.003289
polarizability: 1.24099552e+02 -1.23200375e+01 7.60058244e+01 5.54620193e+00 1.22587858e+01 8.97689090e+01
1716.lowfreq: -11.1529 -3.7934 -0.0007 -0.0007 -0.0005 13.9367 31.6472 51.0573 108.1313
frequency: 31.4016 51.0107 108.0507 156.0268 222.8711 263.4688 350.4414 376.5460 405.5690 426.0422 449.0303 524.5657 614.7823 622.0531 707.1843 737.3157 742.7272 782.7837 831.9917 862.2810 922.1690 930.5119 975.2207 985.2117 987.7412 995.7264 1005.2741 1025.6964 1049.1895 1080.0484 1093.3426 1172.5683 1174.4583 1182.9688 1187.5045 1247.0634 1305.4893 1313.4210 1348.9294 1370.6059 1384.6998 1395.8567 1439.0550 1469.7734 1486.3867 1590.2056 1615.2189 3004.9541 3075.4764 3089.0320 3106.2813 3115.9257 3130.3513 3142.3668 3154.7460 3167.4582 3549.6383
redmass: 4.9614 4.3843 3.2082 3.9619 3.9463 3.7026 1.8097 2.2415 2.8375 3.6526 4.2245 3.7142 6.3459 4.2000 2.1528 2.5007 4.2968 2.1223 5.1714 1.2529 1.9245 1.6486 4.5152 1.3778 5.8375 1.5559 1.3983 2.1347 1.2455 1.5799 1.4852 1.2534 1.3155 1.1546 1.5465 1.3719 1.3021 1.4149 1.3456 1.4259 5.2758 2.3620 2.2027 1.0827 2.4761 6.1062 6.0940 1.0643 1.0867 1.0961 1.0960 1.0878 1.0864 1.0916 1.0955 1.1012 1.0664
irintensity: 1.6538 0.5731 2.9944 1.5785 4.2196 8.5443 78.1712 63.0692 1.6196 2.7071 0.2664 9.0670 0.3220 11.5128 31.5175 69.3814 18.9165 22.1431 17.4844 0.0787 34.4444 3.7809 48.7970 0.3100 0.0370 0.4220 0.6346 6.6357 13.3015 8.0786 27.0734 3.0547 4.3740 2.3367 2.0601 2.5455 9.0021 6.2027 13.9582 13.2345 0.6972 1.3570 10.1225 11.2163 13.3846 1.0748 4.6045 29.1451 9.7335 14.8957 47.7364 10.6106 0.7556 18.2987 20.7969 18.7677 3.8647
temp: 298.150 k
press: 1.00000 atm
elementType: 8 8 6 6 6 6 6 6 6 6 6 1 1 1 1 1 1 1 1 1 1
symmnumber: 1
zpe: 439847.2 jmol-1
zpe.correction: 0.167529 hartree
zpe.thermalcorrener: 0.177559 hartree
zpe.thermalcorrenthalpy: 0.178504 hartree
zpe.thermalcorrgfe: 0.130870 hartree
zpe.sumelectzpe: -498.534244 hartree
zpe.sumelectthermal: -498.524213 hartree
zpe.sumelectthermalent: -498.523269 hartree
zpe.sumelectthermalfe: -498.570903 hartree
dipole: -2.0641 0.7235 0.9079
dipole: 2.3682
quadrupole: -63.4468 -74.2551 -58.3865
quadrupole: -4.5984 2.8348 3.7763
quadrupole: 1.9160 -8.8923 6.9763 -4.5984 2.8348 3.7763
hfenergy: -498.7017727 hartree
pointgroup: C01 [X(C9H10O2)]
dipole: -0.773152 0.3447796 0.3891432 debye
dipolederiv: -0.4167284 0.0328757 -0.016814 0.1620214 -0.7091567 -0.0442161 0.0300332 -0.0890419 -0.3605847 -0.1893459 0.0602561 -0.0866249 -0.1351312 -0.7773123 0.0396319 -0.1054756 -0.0093817 -0.5216619 0.1933235 -0.0183794 0.0256443 -0.2342346 0.2713461 -0.0287965 0.0429848 -0.0813043 0.2713049 0.2770473 -0.0113513 0.0648188 0.0451579 0.271133 -0.0708296 0.015148 0.0559659 0.1582654 0.2026561 -0.067537 0.0178665 -0.0685098 -0.0590272 0.0217278 0.10556 0.0105416 -0.0795355 0.2149262 -0.074193 -0.0287491 0.1247332 0.5275386 0.0728831 -0.0463112 0.0690402 0.296556 -0.1736204 -0.0086747 0.0652392 -0.0051577 -0.1382004 0.0468675 0.0304595 0.0597016 0.0595169 -0.142457 -0.0357442 -0.0342863 -0.0616531 -0.0601034 0.0702673 -0.0573793 0.0544723 -0.0575396 -0.0228509 -0.0909762 -0.0291663 -0.1061326 -0.0390743 0.0942601 -0.0359832 0.1021113 0.0086912 -0.0314826 -0.029105 0.0857294 -0.0155761 -0.0976582 0.0603834 0.0995293 0.0720391 0.1036479 0.0140198 -0.0979258 0.0601224 -0.0838542 -0.1016126 0.0044505 0.0517211 -0.002391 -0.0764943 -0.005267 0.0281581 0.0248864 0.0592784 0.0517341 0.0455494 -0.0062379 0.0624155 -0.1104287 -0.1104352 0.0044204 -0.099897 -0.0039516 0.0484485 0.0403212 -0.061355 0.033608 -0.0023644 -0.01139 -0.0186668 -0.1502777 -0.007431 -0.0169705 -0.0453045 -0.1275146 -0.017977 -0.0175271 -0.0781559 0.0330127 0.1214823 -0.0264726 0.0332596 -0.0090452 0.0998427 -0.0150843 0.0405888 0.0821183 0.008827 -0.0992493 0.0155392 0.1204304 -0.0365096 -0.0849954 -0.0462441 -0.0625622 0.102727 0.0687524 0.0495084 0.0598828 0.0823098 -0.0679703 0.0473453 -0.0505966 0.0547943 0.0393643 0.0883058 0.0515952 0.1016103 0.0551467 -0.0984363 0.0576975 -0.0991049 0.0155523 0.0623309 0.0126633 -0.0781532 0.0125337 0.1187885 -0.0601512 -0.0982168 -0.0562923 -0.0672851 0.054123 0.0139283 0.1206204 0.0594773 0.3179784 -0.0372038 0.1115179 -0.0554106 0.2640131 -0.0609031 0.1013537 -0.0642953 0.1078701 0.1010017 0.0021209 -0.0683702 0.0029334 0.0830528 unknown
polarizability: 120.6462781|-18.0204093|77.5928739|5.3655952|10.5227957|91.6351331 unknown
InChI: InChI=1S/C9H10O2/c10-6-8-9(11-8)7-4-2-1-3-5-7/h1-5,8-10H,6H2
charge 0 multiplicity 1
21 atoms
O  1.637426 -1.848523 -0.022532
O  2.463864 1.872789 -0.186818
C  0.918018 -0.924942 0.929024
C  2.252645 -0.51539 0.344162
C  -0.388118 -0.342745 0.47994
C  2.36599 0.520085 -0.762737
C  -1.107159 0.507133 1.361608
C  -0.92539 -0.628467 -0.800078
C  -2.334092 1.07959 0.959583
C  -2.155828 -0.059284 -1.198163
C  -2.860909 0.799893 -0.32357
H  0.937319 -1.277605 1.970277
H  3.129097 -0.59578 1.001875
H  1.516687 0.432347 -1.46687
H  3.30605 0.384626 -1.321096
H  -0.710228 0.714974 2.363536
H  -0.381113 -1.315402 -1.456895
H  -2.880796 1.735418 1.646333
H  -2.56691 -0.290892 -2.187038
H  1.591645 2.102723 0.225478
H  -3.815299 1.23975 -0.633322
