program: Gaussian 09
title: 000188580
version: EM64L-G09RevD.01
frameworkgroup: C1[X(C22H14O3)]
method: RPBEPBE
basis: SDD
operation: Freq
keyword: #pfreq=noraman
keyword: PBEPBE/SDD
title: #p freq=noraman PBEPBE/SDD
converged: YES YES NO NO
title: Mulliken charges:
elementType: O O O C C C C C C C C C C C C C C C C C C C C C C H H H H H H H H H H H H H H
charge: -0.431426 -0.443803 -0.423743 -0.352718 -0.032569 0.094911 -0.240501 -0.233668 0.279167 0.394551 0.368892 0.016737 -0.087058 0.562541 -0.722713 0.482230 -0.409987 -0.476130 -0.536466 0.176811 -0.511575 -0.449643 -0.193466 -0.373320 -0.238436 0.279050 0.203482 0.225020 0.278970 0.239923 0.285276 0.246895 0.339845 0.245908 0.366734 0.229291 0.250606 0.230003 0.360376
chargesum: 0.00000
title: Mulliken charges with hydrogens summed into heavy atoms:
elementType: O O O C C C C C C C C C C C C C C C C C C C C C C
charge: -0.091581 -0.077069 -0.063367 -0.352718 -0.032569 0.094911 0.038550 -0.030186 0.279167 0.394551 0.368892 0.016737 -0.087058 0.562541 -0.497692 0.482230 -0.131017 -0.236208 -0.251190 0.176811 -0.264680 -0.203736 0.035826 -0.122713 -0.008434
polarizability: 4.97567978e+02 -3.07433622e+01 3.06007428e+02 1.03388500e+00 -1.92891422e+00 1.03313485e+02
1716.lowfreq: -8.9197 -4.3364 -0.0003 0.0000 0.0001 1.2450 56.5155 59.8287 84.0260
frequency: 56.4960 59.8243 84.0228 88.2196 127.4732 158.9939 193.9946 203.4816 216.2670 235.7609 243.1639 277.7678 308.7820 319.8407 328.3503 337.5048 355.2395 359.9792 363.8003 384.5758 437.2615 449.5899 478.9747 486.0788 501.5642 506.4749 520.6900 532.3137 538.4557 550.8211 587.5110 610.5733 614.1176 624.2029 660.2884 678.0123 697.2787 723.8984 748.1678 758.9898 760.6757 796.3060 802.3708 819.9968 832.5142 854.8357 865.8209 897.7618 900.1599 908.8758 911.2908 933.9402 954.6670 975.4653 979.5699 988.0450 992.8838 1032.8750 1045.9227 1054.2248 1073.4572 1103.4983 1122.8220 1138.3845 1143.8768 1166.8892 1176.0723 1181.8292 1187.6759 1200.6818 1229.0550 1235.5683 1242.5118 1254.5050 1283.0431 1295.7739 1311.5997 1341.6261 1357.9357 1361.0095 1372.2147 1389.8414 1399.9346 1417.1872 1423.5258 1440.6864 1450.9641 1466.4377 1482.8154 1506.0104 1570.9530 1576.3175 1580.9992 1596.7565 1600.4919 1615.8369 1630.5257 2839.2866 2997.2097 3097.8074 3123.3479 3131.6379 3133.3237 3139.2597 3159.1498 3162.2527 3169.8617 3175.7192 3526.9983 3530.6729 3592.2290
redmass: 5.6939 5.1219 5.7865 5.7363 5.8780 4.3976 4.7084 5.0813 4.9705 4.7159 4.0284 4.6067 1.9436 3.5962 2.7688 4.0095 2.1686 4.3369 2.2618 6.0206 3.2737 4.3215 3.5565 1.3244 4.0434 5.8268 4.4219 4.7116 4.3860 7.0642 5.3535 4.3382 5.6245 4.3120 6.2917 4.3082 6.6429 3.8166 2.5204 3.7753 1.9525 2.2695 1.9792 4.9109 2.9840 1.6283 4.5617 2.2249 1.6357 4.8917 3.5547 1.7037 5.2545 1.3570 1.4914 1.9373 2.2964 3.7801 2.4795 4.8366 2.2123 2.0040 1.8656 2.1632 1.4526 1.6112 1.3769 1.5873 1.3369 1.5523 1.5087 1.4933 1.7664 1.6982 2.6252 1.5840 1.5095 2.0291 1.8098 2.2429 1.7080 2.7067 4.7152 3.0664 7.7363 3.3797 4.3255 3.9421 4.3848 4.5898 6.4252 7.0380 6.8078 7.9104 8.8938 8.1076 8.4843 1.0789 1.0829 1.0912 1.0870 1.0905 1.0898 1.0871 1.0985 1.0932 1.0949 1.0976 1.0652 1.0657 1.0657
irintensity: 0.5082 0.1970 0.7297 2.6402 1.5514 1.1328 2.7807 4.0870 4.9889 6.3854 4.4576 7.8116 37.4559 20.3540 33.8308 21.7930 21.6800 16.1240 26.0697 1.7271 6.2924 5.8425 37.7397 146.6305 0.4139 0.1919 4.0294 2.4177 1.1414 10.2479 15.2343 1.9717 5.1059 2.9146 6.6325 9.6307 11.0591 15.3524 7.1646 12.3459 32.3352 1.7926 50.1789 14.3697 33.9984 9.1668 17.2774 60.0303 6.0576 3.2151 29.5879 8.0443 57.4275 3.7409 4.6318 7.1786 13.5206 25.5906 5.6842 50.0702 32.9364 11.4919 87.4879 121.2150 15.1148 5.6488 27.8080 18.0251 20.9612 62.9766 7.7520 21.8037 2.7241 5.6765 12.8523 11.7376 1.1994 17.3118 55.0505 31.4295 17.3566 1.0002 1.0762 43.3967 11.5121 5.0480 54.9039 19.8512 40.1735 22.2875 35.0967 1.3631 36.8897 12.1232 16.8271 24.3004 20.3503 45.5784 12.1659 25.8324 5.2403 1.2805 15.9701 16.7231 45.6599 5.0211 10.7359 19.1044 21.6269 2.0296 10.1608
temp: 298.150 k
press: 1.00000 atm
elementType: 8 8 8 6 6 6 6 6 6 6 6 6 6 6 6 6 6 6 6 6 6 6 6 6 6 1 1 1 1 1 1 1 1 1 1 1 1 1 1
symmnumber: 1
zpe: 774133.9 jmol-1
zpe.correction: 0.294852 hartree
zpe.thermalcorrener: 0.313222 hartree
zpe.thermalcorrenthalpy: 0.314166 hartree
zpe.thermalcorrgfe: 0.249929 hartree
zpe.sumelectzpe: -1070.753979 hartree
zpe.sumelectthermal: -1070.735609 hartree
zpe.sumelectthermalent: -1070.734665 hartree
zpe.sumelectthermalfe: -1070.798901 hartree
dipole: 1.7635 -1.4282 1.6126
dipole: 2.7839
quadrupole: -131.8043 -135.6767 -147.1699
quadrupole: -11.5818 -1.5682 4.0630
quadrupole: 6.4127 2.5402 -8.9529 -11.5818 -1.5682 4.0630
hfenergy: -1071.0488307 hartree
pointgroup: C01 [X(C22H14O3)]
dipole: 0.7053929 -0.5626757 0.6208488 debye
polarizability: 496.9415989|-32.1633698|306.4196421|-8.513874|-2.4639632|103.52765 unknown
InChI: InChI=1S/C22H14O3/c23-15-6-2-5-12-17(15)14-9-11-4-1-3-10-7-8-13-18(16(10)11)19(14)20(12)22(25)21(13)24/h1-9,21-25H
charge 0 multiplicity 1
39 atoms
O  -1.655041 3.662851 0.293213
O  1.177277 4.165568 -0.235958
O  -3.211153 -3.183407 0.292586
C  -0.200573 0.226533 0.088187
C  -1.185726 1.199179 -0.009166
C  1.214663 0.45912 0.021482
C  -0.760576 2.622298 -0.275015
C  0.680052 2.889572 0.269828
C  1.699902 1.784907 0.010626
C  -0.777593 -1.11855 0.12252
C  -2.485517 0.516272 -0.026382
C  2.08721 -0.666878 -0.038322
C  -2.24057 -0.91082 0.093199
C  1.535447 -2.005788 -0.001848
C  0.085174 -2.205174 0.074318
C  3.50512 -0.442999 -0.135582
C  3.099274 2.004263 -0.092621
C  3.982125 0.911398 -0.174618
C  -3.7976 1.020078 -0.132147
C  -3.338253 -1.792348 0.145145
C  2.43365 -3.09501 -0.059442
C  4.37245 -1.585369 -0.193381
C  -4.878837 0.098839 -0.109373
C  -4.661375 -1.287332 0.035581
C  3.839492 -2.881341 -0.153534
H  -0.784822 2.848933 -1.359794
H  0.561285 2.950489 1.384485
H  -0.264579 -3.246239 0.043639
H  3.472691 3.032145 -0.114021
H  5.060379 1.087883 -0.264791
H  -3.975294 2.093979 -0.239187
H  2.044994 -4.120231 -0.034606
H  -1.841178 3.423545 1.238903
H  5.455567 -1.434517 -0.270142
H  0.447966 4.8278 -0.106219
H  -5.906763 0.467298 -0.19664
H  -5.494554 -1.995184 0.071797
H  4.509527 -3.74651 -0.197905
H  -2.281037 -3.432154 0.517082
