program: Gaussian 09
title: 000188573
version: EM64L-G09RevD.01
frameworkgroup: C1[X(C12H18N2O3)]
method: RPBEPBE
basis: SDD
operation: Freq
keyword: #p
keyword: freq=noraman
keyword: PBEPBE/SDD
title: #p freq=noraman PBEPBE/SDD
converged: YES YES NO NO
title: Mulliken charges:
elementType: O O O N N C C C C C C C C C C C C H H H H H H H H H H H H H H H H H H
charge: -0.239624 -0.306862 -0.269052 -0.146298 -0.409423 0.381999 -0.553954 -0.517102 -0.434875 -0.463227 0.052086 -0.338176 -0.374024 0.125695 -0.323262 -0.304861 -0.080502 0.299486 0.226341 0.245830 0.213834 0.211337 0.223696 0.216239 0.224679 0.224618 0.251727 0.262110 0.229771 0.198060 0.228800 0.225522 0.208210 0.340229 0.170973
chargesum: 0.00000
title: Mulliken charges with hydrogens summed into heavy atoms:
elementType: O O O N N C C C C C C C C C C C C
charge: -0.239624 -0.306862 -0.269052 -0.146298 -0.069194 0.381999 -0.028127 -0.057438 0.000158 -0.022309 0.052086 0.138170 0.117857 0.125695 0.103599 0.128871 0.090471
polarizability: 1.73855877e+02 3.43017112e-01 1.53312416e+02 -9.97350777e+00 -6.22107263e+00 1.28939555e+02
1716.lowfreq: -8.6383 -0.0010 -0.0008 -0.0007 2.9683 13.0201 38.0099 58.7193 66.6230
frequency: 37.9530 58.6819 66.5726 78.6095 96.5104 103.9458 139.8482 151.0092 180.3373 218.2021 232.4670 256.4582 280.4606 302.7527 336.0982 364.1320 403.3806 411.2693 446.4073 462.0708 464.0929 557.2910 576.9114 610.1577 621.0988 689.9469 715.6819 730.4780 771.6684 797.3492 832.7222 835.9158 853.3889 862.7526 903.6634 913.0426 916.7530 952.3473 955.2797 973.8211 999.7696 1006.7002 1023.2129 1050.5401 1055.5419 1070.4748 1071.2617 1122.4254 1136.2919 1151.2187 1177.7627 1192.1724 1194.1926 1206.0771 1209.9508 1232.3111 1252.4854 1266.5728 1273.5879 1277.5078 1296.5808 1311.6863 1316.4399 1328.1660 1340.5223 1352.7838 1366.3027 1373.9688 1415.7922 1436.9477 1447.8626 1451.8102 1454.8358 1456.8548 1458.6670 1460.2483 1472.8539 1483.2272 1541.2019 1626.3784 1659.6020 2935.1473 2950.9651 2955.5195 2962.6169 2970.1337 2992.2136 2997.2214 2998.6739 2999.4204 3026.4049 3053.1325 3064.4079 3077.8066 3083.2129 3088.6758 3090.2674 3091.5887 3451.7367
redmass: 6.7847 3.7071 3.8450 3.2499 4.3085 3.6993 4.3860 4.4426 3.4722 3.3532 1.9908 2.6261 3.1067 3.9607 3.0725 3.2288 2.1307 3.4997 3.9894 4.7158 3.0860 3.2321 2.0551 5.2018 2.3557 2.7638 2.7479 1.5763 3.0996 4.1812 2.3369 1.6490 4.3932 1.9768 2.2927 2.5568 1.5956 1.6160 2.4987 2.6603 2.3455 2.3487 1.6194 2.2162 1.9292 2.5753 3.5894 2.3904 1.3780 1.4908 3.4051 1.7632 1.5293 1.9315 1.3930 1.3523 1.6012 1.5583 1.2375 1.3641 1.2896 1.5048 1.4985 1.2370 1.2168 1.3568 1.3034 1.2094 2.7120 1.1444 1.0830 1.1206 1.2512 1.1256 1.1351 1.6117 1.0842 1.1009 6.2854 5.2908 9.3700 1.0860 1.0679 1.0669 1.0676 1.0631 1.0636 1.0636 1.0609 1.0676 1.0954 1.0935 1.0998 1.1047 1.0955 1.0962 1.0996 1.1015 1.0763
irintensity: 1.2704 0.3243 3.2978 0.4596 4.7419 7.4881 4.9793 2.5613 13.0588 14.5010 1.3759 0.7301 7.2380 11.1361 5.3786 15.7158 2.4221 0.2447 18.9447 6.9417 3.6933 10.5052 4.7414 14.5008 2.2942 7.0872 71.7294 71.7534 1.5102 19.5171 3.6148 0.4436 7.6203 3.1711 3.6729 3.1828 5.0719 2.7945 20.4214 2.5347 27.0119 12.2660 6.7269 41.2285 0.0580 9.8409 29.4483 2.0744 0.5398 0.7183 0.9365 11.3581 10.7564 8.3543 5.8479 46.6220 38.5636 61.5873 21.7184 44.7747 5.2952 2.2065 2.7703 1.6242 7.0799 4.3200 3.5725 7.2106 134.2002 28.1622 1.7419 14.4122 19.5063 31.9082 12.2896 231.8673 8.8815 3.9516 254.3101 198.6496 11.6834 119.1442 42.8702 19.2404 52.1877 10.4305 18.4997 54.1815 37.0549 38.1365 7.4870 18.6173 37.9232 55.0178 32.6469 20.5836 10.1266 16.7882 55.5253
temp: 298.150 k
press: 1.00000 atm
elementType: 8 8 8 7 7 6 6 6 6 6 6 6 6 6 6 6 6 1 1 1 1 1 1 1 1 1 1 1 1 1 1 1 1 1 1
symmnumber: 1
zpe: 765451.3 jmol-1
zpe.correction: 0.291545 hartree
zpe.thermalcorrener: 0.307765 hartree
zpe.thermalcorrenthalpy: 0.308709 hartree
zpe.thermalcorrgfe: 0.247347 hartree
zpe.sumelectzpe: -801.927401 hartree
zpe.sumelectthermal: -801.911182 hartree
zpe.sumelectthermalent: -801.910237 hartree
zpe.sumelectthermalfe: -801.971600 hartree
dipole: 0.4216 -2.0674 -0.7950
dipole: 2.2548
quadrupole: -105.7375 -96.3538 -110.1018
quadrupole: 5.0262 2.7774 -4.0985
quadrupole: -1.6731 7.7106 -6.0375 5.0262 2.7774 -4.0985
hfenergy: -802.2189462 hartree
pointgroup: C01 [X(C12H18N2O3)]
dipole: 0.113943 0.7542616 -0.4528133 debye
polarizability: 168.3076976|-2.2846806|154.8496424|17.7935843|-1.8919555|132.9505073 unknown
InChI: InChI=1S/C12H18N2O3/c15-9-13-11(10-3-1-2-4-10)12(16)14-5-7-17-8-6-14/h9,13H,1-8H2
charge 0 multiplicity 1
35 atoms
O  -3.717499 1.645875 0.436628
O  -0.751648 -1.208955 -1.940127
O  1.39882 -2.506162 2.358448
N  -1.221713 0.645793 -0.605137
N  0.737672 -2.286223 0.100963
C  1.761525 -0.042362 0.26411
C  3.08643 -0.525723 0.843128
C  1.857521 1.456727 -0.007939
C  3.981573 0.741451 0.934627
C  3.384862 1.708539 -0.121269
C  0.714514 -0.85832 -0.073557
C  -1.266951 1.288328 0.727962
C  -2.301331 1.084806 -1.52375
C  -0.469323 -0.472894 -0.928373
C  -2.677904 1.125398 1.336516
C  -3.6760 0.922283 -0.848008
C  1.037309 -2.995806 1.250509
H  2.934983 -1.033141 1.814162
H  3.526365 -1.287395 0.166562
H  1.285944 1.775362 -0.897077
H  1.463963 2.031328 0.857265
H  3.897532 1.189871 1.94299
H  5.048217 0.519104 0.758574
H  3.737475 1.432752 -1.133459
H  3.654621 2.764727 0.055571
H  -1.033212 2.365753 0.624806
H  -0.521422 0.818785 1.389765
H  -2.239011 0.473146 -2.438932
H  -2.136876 2.150569 -1.774761
H  -2.869719 0.052348 1.556319
H  -2.76857 1.711639 2.26581
H  -4.474362 1.367531 -1.463403
H  -3.89186 -0.15471 -0.681838
H  0.324643 -2.796775 -0.69127
H  0.922626 -4.092252 1.088789
