program: Gaussian 09
title: 000196632
version: EM64L-G09RevD.01
frameworkgroup: C1[X(C13H16N6O6)]
method: RPBEPBE
basis: SDD
operation: Freq
keyword: #p
keyword: freq=noraman
keyword: PBEPBE/SDD
title: #p freq=noraman PBEPBE/SDD
converged: YES YES NO NO
title: Mulliken charges:
elementType: O O O O O O N N N N N N C C C C C C C C C C C C C H H H H H H H H H H H H H H H H
charge: -0.282139 -0.236242 -0.230071 -0.235688 -0.175334 -0.179348 -0.149345 -0.155895 -0.027896 -0.033797 0.071960 0.072292 0.030467 -0.451211 -0.465759 0.258723 0.258723 -0.284927 -0.247428 0.063542 0.070155 -0.762787 -0.755828 0.312061 -0.753844 0.279535 0.246340 0.279919 0.258453 0.261870 0.314667 0.314076 0.266559 0.244535 0.276671 0.286559 0.234818 0.243493 0.252854 0.270933 0.258333
chargesum: 0.00000
title: Mulliken charges with hydrogens summed into heavy atoms:
elementType: O O O O O O N N N N N N C C C C C C C C C C C C C
charge: -0.282139 -0.236242 -0.230071 -0.235688 -0.175334 -0.179348 -0.149345 -0.155895 -0.027896 -0.033797 0.071960 0.072292 0.310003 0.075048 0.054565 0.258723 0.258723 0.029739 0.066648 0.063542 0.070155 0.024979 0.009042 0.312061 0.028277
polarizability: 2.66173877e+02 3.38593578e+01 1.98363771e+02 -1.08110736e+01 -4.56708629e+00 1.64325933e+02
1716.lowfreq: -8.4613 -4.2495 -0.0006 -0.0003 0.0001 0.6171 15.8993 20.2341 23.4519
frequency: 15.7988 20.0426 23.4441 33.8358 41.2351 45.5443 51.1302 58.1532 72.6133 87.8175 91.1819 125.5708 133.3966 137.4352 148.3918 169.6242 174.9663 186.8342 199.3207 219.5586 259.6999 270.6576 285.4014 312.5500 329.4399 383.6002 387.1069 390.7287 395.2398 417.5082 452.0758 484.7329 547.3347 548.4542 567.3887 601.0651 606.0161 618.9421 650.8504 651.5762 673.8251 682.6408 713.3411 713.9482 726.7861 728.8375 771.9887 774.1560 794.5781 807.0754 819.7986 871.7014 916.3199 951.0782 951.5091 986.8713 994.2461 1001.2349 1013.4328 1042.9834 1044.9470 1045.9319 1055.5988 1086.3077 1107.1912 1108.3169 1128.8680 1165.8337 1182.9268 1192.7381 1205.3305 1224.5591 1242.8716 1295.2389 1297.5340 1306.2563 1311.9020 1340.6684 1346.0631 1361.0924 1362.2208 1370.1762 1371.1093 1389.4994 1398.4279 1399.2455 1404.8308 1413.2475 1450.8651 1451.9938 1454.3664 1457.3216 1471.8230 1472.9421 1474.3717 1477.8623 1499.0445 1503.2373 1522.0806 1525.9846 1658.0586 2984.2168 2987.3725 3006.4287 3022.0310 3030.7932 3040.2906 3058.3679 3067.5727 3089.8883 3096.4726 3101.7167 3126.0638 3126.3109 3146.2257 3258.6773 3276.9780
redmass: 6.5284 6.1513 6.7488 6.0548 6.3286 1.1500 8.6980 7.7731 4.5606 4.7696 5.0808 1.3437 2.3319 1.5920 3.3321 3.8454 5.9558 4.4735 4.3941 4.5756 4.3721 2.9918 2.5521 4.6156 4.7518 6.4518 4.1863 4.2135 5.1190 3.0530 4.6711 3.8693 4.6194 4.7915 3.2488 5.2519 5.4112 5.1283 5.0709 5.2430 4.8913 5.3048 5.3369 5.8459 6.6917 7.9839 4.2497 3.5389 3.3366 1.6172 1.5519 2.5943 3.3565 5.9518 6.2362 1.8525 1.9518 1.8723 2.8748 1.6680 1.4958 1.5364 2.5617 2.7600 2.1105 1.7653 1.9499 3.5618 3.2587 3.5013 3.8886 3.0322 2.5281 7.9057 8.5378 1.8642 1.2516 1.9605 1.9573 1.9694 2.4874 2.8622 3.3508 1.2619 3.4378 2.6263 1.4717 1.2249 1.0598 1.0492 1.1153 1.1219 1.1338 1.0788 1.0778 1.1851 5.4619 5.7443 4.8117 5.3290 9.5728 1.0401 1.0415 1.0390 1.0655 1.0714 1.0694 1.0982 1.0954 1.1031 1.0946 1.1048 1.0978 1.0959 1.1016 1.1013 1.1013
irintensity: 2.9844 1.9080 2.2162 1.8743 2.6407 1.4838 0.3027 0.5705 2.1104 1.6185 0.0472 0.2535 0.0298 0.2199 1.6286 0.8850 3.9128 3.0677 1.9705 4.3209 10.5700 0.3726 4.4822 0.7787 4.4167 9.2547 3.0811 3.7921 0.2630 4.3907 5.7092 8.1520 1.6447 0.8320 6.3739 2.4735 2.1123 5.4602 4.7767 25.0399 9.2958 10.9717 12.8247 12.1728 14.8118 11.7209 11.1422 40.3433 17.8770 37.4102 35.0861 28.0903 42.5667 6.1960 5.3504 21.1269 37.1389 4.1569 81.4717 7.7099 3.5991 4.9820 40.4054 13.6011 6.6381 7.1830 21.1360 7.3458 242.1185 238.9027 93.1742 258.5450 43.6604 40.4386 38.3031 5.6316 1.1361 24.1305 26.6245 40.9762 103.1094 80.2302 117.0037 60.1093 9.2843 9.5019 7.0637 16.6243 26.2808 18.2372 21.7659 28.7265 1.9701 24.8166 3.2956 41.3423 33.3550 37.9353 75.9971 85.5151 159.3924 16.0109 6.2911 0.0839 13.2194 1.0776 22.9889 13.2063 6.1103 3.7433 3.6522 2.4293 0.9076 2.4515 4.9672 6.6990 7.9409
temp: 298.150 k
press: 1.00000 atm
elementType: 8 8 8 8 8 8 7 7 7 7 7 7 6 6 6 6 6 6 6 6 6 6 6 6 6 1 1 1 1 1 1 1 1 1 1 1 1 1 1 1 1
symmnumber: 1
zpe: 790318.3 jmol-1
zpe.correction: 0.301016 hartree
zpe.thermalcorrener: 0.326078 hartree
zpe.thermalcorrenthalpy: 0.327022 hartree
zpe.thermalcorrgfe: 0.241066 hartree
zpe.sumelectzpe: -1282.804522 hartree
zpe.sumelectthermal: -1282.779460 hartree
zpe.sumelectthermalent: -1282.778516 hartree
zpe.sumelectthermalfe: -1282.864472 hartree
dipole: -0.6536 7.7914 -4.5208
dipole: 9.0317
quadrupole: -235.1595 -145.1268 -145.0894
quadrupole: 0.9750 -2.9211 -2.4388
quadrupole: -60.0342 29.9984 30.0358 0.9750 -2.9211 -2.4388
hfenergy: -1283.1055379 hartree
pointgroup: C01 [X(C13H16N6O6)]
dipole: -0.6455134 -2.8591935 2.0086211 debye
polarizability: 257.1370799|-39.2859868|205.4375571|15.8073427|-10.1369572|166.288944 unknown
InChI: InChI=1S/C13H16N6O6/c1-8-14-12(18(21)22)6-16(8)4-11(25-10(3)20)5-17-7-13(19(23)24)15-9(17)2/h6-7,11H,4-5H2,1-3H3
charge 0 multiplicity 1
41 atoms
O  0.869889 -2.128161 0.949256
O  0.329272 -3.475125 -0.876453
O  -4.663704 2.810121 0.966447
O  5.679801 -0.227206 0.632808
O  -5.623899 2.360142 -1.065131
O  5.904418 1.365267 -0.999056
N  -2.576189 -0.722713 0.321123
N  1.632377 0.676477 0.405553
N  -4.042569 0.000536 -1.254523
N  3.081608 1.73519 -0.985023
N  -4.821961 2.0829 -0.101266
N  5.199438 0.66654 -0.183425
C  -0.108328 -1.119417 0.462451
C  -1.521505 -1.523952 0.96246
C  0.37128 0.23362 1.017449
C  -3.164834 -0.97383 -0.94392
C  1.784665 1.616603 -0.644875
C  -3.119254 0.462517 0.81445
C  2.896459 0.189638 0.725613
C  -4.013307 0.877988 -0.175087
C  3.761503 0.858634 -0.143065
C  -2.878185 -2.187401 -1.77269
C  0.650965 2.372437 -1.265554
C  1.033829 -3.279416 0.136263
C  2.145393 -4.147415 0.663842
H  -0.096178 -1.123082 -0.643669
H  -1.590429 -1.408194 2.058083
H  -1.686619 -2.585717 0.718206
H  0.505679 0.152774 2.110918
H  -0.397074 0.999898 0.821058
H  -2.876974 0.886899 1.783632
H  3.076889 -0.547936 1.4991
H  -1.802169 -2.425986 -1.839278
H  -3.388156 -3.081882 -1.366162
H  -3.270449 -2.012984 -2.785709
H  1.061992 2.993328 -2.075287
H  -0.117667 1.706977 -1.701039
H  0.148798 3.044216 -0.544162
H  2.083769 -4.242185 1.760152
H  3.120199 -3.682586 0.42697
H  2.101525 -5.138313 0.189838
