program: Gaussian 09
title: 000196576
version: EM64L-G09RevD.01
frameworkgroup: C1[X(C11H18O7)]
method: RPBEPBE
basis: SDD
operation: Freq
keyword: #pfreq=noraman
keyword: PBEPBE/SDD
title: #p freq=noraman PBEPBE/SDD
converged: YES YES NO NO
title: Mulliken charges:
elementType: O O O O O O O C C C C C C C C C C C H H H H H H H H H H H H H H H H H H
charge: -0.310205 -0.287573 -0.433599 -0.231578 -0.208829 -0.409113 -0.242322 -0.086045 -0.048338 -0.105567 -0.468286 -0.705264 0.291930 -0.046808 -0.508642 -0.510940 -0.495000 0.191413 0.270911 0.249205 0.242104 0.252258 0.216770 0.216114 0.229443 0.240374 0.343293 0.258686 0.257454 0.205782 0.242466 0.221132 0.203261 0.283428 0.304804 0.377278
chargesum: 0.00000
title: Mulliken charges with hydrogens summed into heavy atoms:
elementType: O O O O O O O C C C C C C C C C C C
charge: -0.310205 -0.287573 -0.090306 -0.231578 -0.208829 -0.031835 -0.242322 0.184865 0.200868 0.136537 0.000741 -0.019332 0.291930 0.158974 0.007498 0.155920 0.093233 0.191413
polarizability: 1.81201105e+02 1.23486350e+00 1.25887557e+02 2.92026145e-01 -4.65895250e+00 1.15795042e+02
1716.lowfreq: -8.4137 -3.9606 -0.0002 0.0004 0.0007 3.6084 19.6625 23.8446 33.4146
frequency: 19.4351 23.7924 33.3942 47.1896 59.1676 67.5120 69.9746 74.7106 87.7040 92.7457 115.2977 130.8271 146.7111 165.1831 199.0880 210.1237 220.7097 254.0673 276.3848 290.2384 294.5780 318.7883 404.6883 411.5020 440.4310 450.0173 463.0862 510.3330 531.5534 564.2173 567.5359 603.7884 640.8314 652.9753 683.5652 789.5179 793.1952 809.5678 826.4200 860.6795 893.2208 908.5985 942.5703 954.7334 997.9450 1014.2421 1021.2635 1037.9358 1043.7556 1060.2048 1090.5186 1094.6545 1108.3218 1115.3474 1118.2883 1132.8794 1166.7196 1172.3974 1199.2664 1242.0309 1242.9224 1254.8111 1268.7405 1278.3949 1314.4247 1318.0731 1332.0972 1343.9978 1370.1324 1372.7941 1375.3621 1382.4810 1390.6621 1425.4128 1438.6504 1444.1464 1453.4585 1461.6342 1462.0764 1473.9438 1474.5336 1631.6169 1652.6626 1662.8273 2914.9480 2941.6202 2972.6522 2983.5386 2987.1838 3008.0236 3014.6523 3023.0388 3039.4998 3052.0080 3064.4567 3083.4518 3084.5177 3101.2245 3101.7869 3109.3428 3515.5103 3538.4638
redmass: 6.0057 7.9784 6.1133 5.5528 3.3380 5.4124 5.6137 3.6072 2.7802 2.5277 4.2301 2.7295 3.3360 2.0616 2.1152 1.1907 4.9674 3.8750 5.1762 4.0773 4.9030 3.0248 1.2854 4.4874 3.2388 3.0370 2.9323 1.7695 3.1411 3.4467 3.6282 3.8383 1.3676 3.3556 5.8973 1.8569 1.8511 3.4378 3.7051 4.3956 3.1713 3.0900 2.5856 2.7023 2.1364 1.7621 2.1587 3.5577 3.9280 3.4056 2.6398 2.4915 2.0229 1.2938 1.8820 1.8785 1.7679 1.3597 1.3082 1.3730 1.3742 1.5356 1.3125 1.3288 1.4846 1.4557 1.4509 1.2026 1.3040 1.3602 1.2589 1.9133 1.2213 1.1068 1.1275 1.0749 1.0948 1.0538 1.0556 1.0523 1.0506 7.4785 10.3295 8.0358 1.0860 1.0337 1.0708 1.0798 1.0367 1.0633 1.0636 1.1026 1.0842 1.0869 1.0975 1.0972 1.0941 1.0999 1.0974 1.0987 1.0640 1.0653
irintensity: 0.0418 1.0096 1.1887 1.7182 10.1967 3.0395 1.7212 4.0954 2.8684 2.3818 1.4318 0.6373 3.0563 2.4812 9.9807 1.0625 0.8314 9.2324 7.0692 2.4987 3.5282 4.8423 74.5497 14.2237 99.7795 48.2235 4.4213 40.3952 7.7883 32.6749 10.8986 12.0050 115.8670 19.1317 1.9543 3.6066 29.8061 18.9074 5.6820 29.7343 18.8253 9.5290 108.5170 17.8638 4.3529 68.2672 14.3376 172.9440 74.1433 81.9960 97.5500 64.3671 146.2017 9.5285 102.7364 0.9898 25.4867 37.4154 29.2512 26.2480 8.3444 9.2472 8.4810 10.1821 103.2611 7.3873 82.8373 12.9677 11.0268 24.4587 4.0891 25.0478 14.8861 20.1375 6.3858 5.1579 67.1273 9.5718 20.2904 11.2047 9.2548 128.8423 218.1237 146.0046 60.3588 71.3464 10.9770 23.9668 12.7659 6.5455 16.5067 59.5746 4.0562 6.4040 1.2608 27.8800 20.2894 23.9091 7.5656 23.4771 24.3163 5.0403
temp: 298.150 k
press: 1.00000 atm
elementType: 8 8 8 8 8 8 8 6 6 6 6 6 6 6 6 6 6 6 1 1 1 1 1 1 1 1 1 1 1 1 1 1 1 1 1 1
symmnumber: 1
zpe: 746937.5 jmol-1
zpe.correction: 0.284493 hartree
zpe.thermalcorrener: 0.305889 hartree
zpe.thermalcorrenthalpy: 0.306833 hartree
zpe.thermalcorrgfe: 0.230758 hartree
zpe.sumelectzpe: -955.084199 hartree
zpe.sumelectthermal: -955.062803 hartree
zpe.sumelectthermalent: -955.061859 hartree
zpe.sumelectthermalfe: -955.137934 hartree
dipole: 2.7804 -1.2214 -1.3679
dipole: 3.3307
quadrupole: -95.5241 -107.0045 -113.2190
quadrupole: -7.4581 -0.6324 7.2832
quadrupole: 9.7251 -1.7553 -7.9698 -7.4581 -0.6324 7.2832
hfenergy: -955.3686925 hartree
pointgroup: C01 [X(C11H18O7)]
dipole: 1.1373964 0.2693886 0.5923904 debye
polarizability: 180.1262404|-7.634286|128.0128227|-1.152145|-3.0285167|114.7446407 unknown
InChI: InChI=1S/C11H18O7/c1-7(13)11(8(17-2)5-6-12)18-10(16)4-3-9(14)15/h6-8,11,13-14H,3-5H2,1-2H3
charge 0 multiplicity 1
36 atoms
O  0.230663 -0.840926 0.302389
O  3.519193 0.672965 -0.303257
O  2.328282 -2.66515 1.04644
O  -0.751716 -0.475917 -1.789244
O  -0.33359 2.530849 -0.032572
O  -5.249381 1.532135 -0.037953
O  -4.918727 -0.505112 1.023644
C  1.59605 -0.721565 -0.29673
C  2.404353 0.266897 0.57301
C  2.243383 -2.122764 -0.325306
C  1.595053 1.495385 1.070954
C  1.535321 -3.098586 -1.27618
C  -0.871042 -0.631037 -0.555963
C  0.891415 2.249575 -0.042101
C  -2.167549 -0.612506 0.227485
C  4.74203 1.017555 0.428447
C  -3.078288 0.528483 -0.271581
C  -4.467829 0.424842 0.316574
H  1.499688 -0.324832 -1.324768
H  2.797804 -0.276817 1.457787
H  3.29769 -1.987584 -0.623996
H  0.855682 1.184866 1.827851
H  2.313012 2.190775 1.555175
H  0.484142 -3.260032 -0.973212
H  1.53027 -2.709983 -2.31033
H  2.052637 -4.072501 -1.263509
H  1.399209 -2.768693 1.380853
H  -1.953053 -0.51373 1.302671
H  -2.684464 -1.581497 0.088035
H  1.541366 2.553631 -0.898667
H  5.494807 1.257334 -0.33849
H  5.092929 0.163497 1.042397
H  4.599056 1.900994 1.084813
H  -3.159931 0.499117 -1.374882
H  -2.643864 1.515283 -0.028713
H  -6.1595 1.428645 0.352826
