program: Gaussian 09
title: 000188538
version: EM64L-G09RevD.01
frameworkgroup: C1[X(C21H31N3O2)]
method: RPBEPBE
basis: SDD
operation: Freq
keyword: #p
keyword: freq=noraman
keyword: PBEPBE/SDD
title: #p freq=noraman PBEPBE/SDD
converged: YES YES NO NO
title: Mulliken charges:
elementType: O O N N N C C C C C C C C C C C C C C C C C C C C C H H H H H H H H H H H H H H H H H H H H H H H H H H H H H H H
charge: -0.267101 -0.436455 -0.259374 -0.157174 -0.348028 -0.226378 -0.086683 0.333683 -0.548921 -0.138936 0.333399 -0.047517 0.282160 -0.430177 0.156234 -0.418583 -0.401088 -0.399973 -0.382669 -0.675807 -0.731975 -0.723076 -0.356724 -0.238427 -0.337165 -0.692072 0.241740 0.247010 0.223443 0.257056 0.232766 0.279546 0.309331 0.219238 0.218765 0.248964 0.220824 0.225405 0.238311 0.248900 0.231840 0.220528 0.194328 0.212219 0.258069 0.196974 0.213653 0.230813 0.213074 0.217532 0.220855 0.197262 0.194535 0.338444 0.213052 0.214964 0.219387
chargesum: 0.00000
title: Mulliken charges with hydrogens summed into heavy atoms:
elementType: O O N N N C C C C C C C C C C C C C C C C C C C C C
charge: -0.267101 -0.098010 -0.259374 -0.157174 -0.038696 0.015362 -0.086683 0.333683 -0.078468 0.118120 0.333399 0.185250 0.282160 -0.150631 0.156234 0.019419 -0.152124 0.046256 -0.144358 0.025460 -0.067358 -0.081636 0.073882 -0.017572 0.054631 -0.044669
polarizability: 3.28190917e+02 -2.73064448e+00 2.66738636e+02 5.77991648e+00 -1.45925302e+01 1.80524032e+02
1716.lowfreq: -7.0811 0.0003 0.0003 0.0004 4.0315 8.4804 23.7126 30.0681 47.5653
frequency: 23.6817 29.7944 47.5423 56.7703 64.9842 67.9415 85.6035 91.1845 99.7159 110.9119 132.0378 141.6239 150.2159 168.9748 178.2479 189.2226 193.6770 202.8406 221.2210 227.0336 231.9910 234.8946 247.8572 260.6945 270.5704 282.8834 296.5303 317.2540 324.7369 342.1568 363.4608 387.8654 405.0372 419.3731 421.1189 430.2298 495.5092 514.8866 535.5923 545.5730 567.3801 592.0252 606.5454 645.4898 647.7057 661.6081 703.1544 709.9026 738.3833 739.9396 752.6532 765.3517 789.8565 794.2177 812.4744 831.3736 837.8458 870.9312 880.0545 888.6336 901.0052 917.8280 923.2136 931.0611 947.7841 956.8985 962.3215 976.6603 990.5338 1015.9611 1016.6045 1043.8293 1062.9335 1072.6251 1075.8876 1082.5144 1098.4135 1107.6111 1114.0415 1118.2188 1129.6510 1141.3116 1149.0649 1159.8192 1174.1403 1188.8424 1193.3397 1196.2965 1204.0191 1217.0734 1230.5264 1260.2450 1263.4708 1271.3596 1275.0238 1281.7189 1291.9324 1296.1055 1312.5707 1319.8390 1330.7949 1341.7288 1344.8112 1351.3886 1358.1890 1361.0444 1364.9721 1374.4302 1377.8344 1381.4539 1389.8591 1392.4530 1403.3460 1428.7897 1438.2650 1459.0739 1464.2117 1466.9621 1468.2113 1469.9059 1472.1600 1474.0385 1476.0469 1476.5609 1479.0857 1482.0955 1484.3624 1491.4968 1492.0097 1507.9541 1548.2860 1558.6712 1602.3469 1608.1048 2932.6862 2964.5785 2967.8353 2971.1874 2975.9911 2980.2632 2981.8203 2990.6281 2994.6082 2997.2359 3006.5018 3007.0287 3007.0828 3020.5908 3034.9093 3057.1087 3061.5747 3064.9255 3066.2694 3066.3979 3073.9531 3076.3374 3079.7010 3082.7260 3088.4469 3128.6243 3144.6097 3161.4518 3210.1193 3483.0893 3562.4106
redmass: 3.7008 4.3013 4.4299 3.7477 1.7578 3.8491 3.5347 3.6551 3.7083 2.4213 2.7097 3.2551 1.4071 3.1727 3.7073 2.8085 2.1698 1.2583 2.0137 1.4181 2.8632 1.5367 2.4186 4.0409 3.4827 3.1521 3.3900 3.2091 1.3959 3.2030 3.4166 2.8415 3.9311 2.6604 2.6803 3.3481 3.7260 3.3312 4.1290 3.9730 4.6179 3.6300 4.2390 4.0042 4.9954 2.6074 3.0383 2.6725 1.0778 3.0783 2.2644 3.5457 2.5880 1.2646 1.6199 2.6538 3.0636 2.5292 2.4409 1.4485 1.7471 1.8783 1.3812 1.2535 2.1843 1.3416 1.7324 3.2580 2.5081 2.9598 2.3750 2.6877 2.1320 2.3186 2.5223 2.3578 1.9384 1.7619 2.3030 1.6938 1.7928 1.3302 2.0662 1.9248 1.6517 1.9095 1.4710 2.2933 2.0795 1.5482 1.4362 1.5168 1.4011 1.2842 1.4258 1.6258 1.0734 1.3051 1.4626 1.8189 1.5370 1.6224 1.4222 1.5511 1.6706 1.5233 2.7070 1.2297 2.4238 1.3090 1.2129 1.2270 4.5455 4.3205 1.2023 1.3004 1.1566 1.1379 1.1151 1.0896 1.1325 1.0786 1.0957 1.0434 1.5565 1.0507 1.3070 1.0812 1.1005 1.1085 5.6811 6.9389 5.2919 7.0624 1.0392 1.0591 1.0370 1.0385 1.0367 1.0637 1.0592 1.0820 1.0601 1.0980 1.0637 1.0842 1.0999 1.0816 1.1020 1.0979 1.1048 1.1009 1.0984 1.0991 1.1011 1.0995 1.0994 1.0965 1.0990 1.0854 1.0917 1.0990 1.0981 1.0757 1.0662
irintensity: 0.0346 0.0704 1.6984 0.9053 0.2192 1.4500 1.8398 0.1377 0.1113 0.0603 6.1148 6.0821 0.9062 2.4603 6.0844 1.0089 4.9047 1.5626 0.5634 0.5045 1.2887 1.2636 9.7877 5.7006 2.7598 0.3568 34.1145 1.7214 95.1649 28.0589 17.5239 1.7354 2.2918 0.5096 10.2667 16.6837 11.3248 8.5526 0.5330 0.7824 1.2678 11.4189 3.4544 43.0644 2.5562 37.1073 4.7034 36.8621 8.8069 13.3187 103.7875 10.4717 16.5819 1.9385 7.6766 1.6080 12.9186 1.8258 7.0544 0.4007 6.3265 20.1316 3.8832 3.6777 0.7905 0.6288 8.2796 60.1372 79.2557 0.2069 20.8066 17.4078 3.6547 20.5075 0.2293 3.9719 18.9231 28.2801 11.2444 3.2254 16.0311 26.2886 16.4088 15.7144 10.1162 1.3839 22.2055 40.8152 20.2745 0.4325 13.3077 36.4469 9.0498 0.2335 18.8308 38.4970 0.6421 9.9052 1.6173 54.3157 4.0765 12.0616 2.3670 12.7926 2.8741 25.1031 5.6431 17.8047 30.9732 11.1255 10.0743 25.5031 29.2511 54.3595 9.5665 62.1693 37.6631 22.3152 23.6956 0.4834 0.9916 4.0206 32.7075 14.2432 37.0773 10.2133 12.3101 40.1149 7.4997 17.2862 43.2545 28.7376 167.2704 10.1355 90.6956 27.6984 24.1562 39.5794 30.1614 47.1759 11.0242 3.7801 82.7943 33.8058 13.3099 20.0616 7.2285 28.5010 3.8483 5.0340 13.6998 6.7329 40.6859 79.6320 80.9081 56.3193 45.2908 18.4907 27.5041 2.7776 20.8202 22.5303 0.3121 10.7875 5.7098
temp: 298.150 k
press: 1.00000 atm
elementType: 8 8 7 7 7 6 6 6 6 6 6 6 6 6 6 6 6 6 6 6 6 6 6 6 6 6 1 1 1 1 1 1 1 1 1 1 1 1 1 1 1 1 1 1 1 1 1 1 1 1 1 1 1 1 1 1 1
symmnumber: 1
zpe: 1279291.9 jmol-1
zpe.correction: 0.487257 hartree
zpe.thermalcorrener: 0.514445 hartree
zpe.thermalcorrenthalpy: 0.515389 hartree
zpe.thermalcorrgfe: 0.430242 hartree
zpe.sumelectzpe: -1131.547525 hartree
zpe.sumelectthermal: -1131.520337 hartree
zpe.sumelectthermalent: -1131.519392 hartree
zpe.sumelectthermalfe: -1131.604539 hartree
dipole: -4.3759 -1.2939 0.4861
dipole: 4.5890
quadrupole: -152.6850 -154.8905 -157.3663
quadrupole: -1.8377 1.7941 -2.7857
quadrupole: 2.2956 0.0901 -2.3857 -1.8377 1.7941 -2.7857
hfenergy: -1132.0347814 hartree
pointgroup: C01 [X(C21H31N3O2)]
dipole: 1.7521665 0.3639455 0.2389987 debye
polarizability: 327.5394533|-6.2201333|262.3128147|-5.5755791|25.2765347|185.6013176 unknown
InChI: InChI=1S/C21H31N3O2/c1-5-6-10-24-12-15-11-16(13-25)22-21(26)20(14(2)3)23(4)17-8-7-9-18(24)19(15)17/h7-9,12,14,16,20,22,25H,5-6,10-11,13H2,1-4H3
charge 0 multiplicity 1
57 atoms
O  -3.688377 -1.611317 -0.246494
O  0.666201 -4.398553 -0.350439
N  -2.07768 1.119407 -0.426408
N  2.660246 0.183391 -0.883221
N  -1.573675 -1.55217 0.74592
C  -2.884766 0.545597 0.687356
C  0.410172 0.613285 -0.598817
C  0.564599 -0.727331 -1.172796
C  -0.457521 -1.802471 -1.469681
C  -0.98791 -2.539302 -0.188768
C  -0.694962 1.450352 -0.200775
C  -4.335602 1.076562 0.769015
C  1.749324 1.135427 -0.407095
C  1.938911 -0.930332 -1.323229
C  -2.809218 -0.983532 0.424595
C  4.126095 0.29163 -0.827186
C  -0.405618 2.683979 0.429386
C  0.095003 -3.365845 0.529308
C  2.022757 2.379693 0.203264
C  -2.584929 1.01383 -1.805969
C  -5.074884 0.418921 1.9582
C  -4.355917 2.616549 0.878766
C  4.722401 -0.092783 0.54832
C  0.923534 3.141569 0.640821
C  6.261448 0.044052 0.572877
C  6.866954 -0.322917 1.944679
H  -2.357159 0.797526 1.628625
H  -1.336112 -1.398516 -2.002675
H  -0.002495 -2.568053 -2.125519
H  -1.816951 -3.204166 -0.499196
H  -4.856395 0.770009 -0.159513
H  2.44984 -1.81293 -1.706946
H  -0.893175 -0.918127 1.178765
H  4.546942 -0.363907 -1.612102
H  4.4143 1.328826 -1.085712
H  -1.252891 3.312758 0.723683
H  -0.33094 -3.808393 1.453096
H  0.958843 -2.733792 0.800031
H  3.047848 2.738972 0.34126
H  -3.085733 0.042877 -1.994863
H  -1.742818 1.117521 -2.510759
H  -3.315471 1.818708 -2.032076
H  -4.575778 0.65834 2.918038
H  -6.11401 0.790751 2.019931
H  -5.113014 -0.678051 1.844826
H  -3.89112 2.950912 1.827384
H  -5.395028 2.993782 0.863123
H  -3.801902 3.085025 0.045934
H  4.435464 -1.135313 0.789324
H  4.278098 0.549014 1.334167
H  1.089472 4.111297 1.122906
H  6.702204 -0.604821 -0.211528
H  6.543366 1.084811 0.31141
H  -0.038564 -5.062366 -0.560209
H  6.469404 0.332954 2.741704
H  6.625759 -1.367044 2.218693
H  7.967326 -0.220399 1.939873
