program: Gaussian 09
title: 000188536
version: EM64L-G09RevD.01
frameworkgroup: C1[X(C17H23N3O)]
method: RPBEPBE
basis: SDD
operation: Freq
keyword: #p
keyword: freq=noraman
keyword: PBEPBE/SDD
title: #p freq=noraman PBEPBE/SDD
converged: YES YES NO NO
title: Mulliken charges:
elementType: O N N N C C C C C C C C C C C C C C C C C H H H H H H H H H H H H H H H H H H H H H H H
charge: -0.274132 -0.260464 -0.341122 -0.407542 -0.225465 -0.046427 -0.071954 -0.060591 -0.582345 0.336070 0.370795 0.163748 0.262483 -0.731342 -0.723968 -0.430042 -0.679125 -0.740174 -0.405469 -0.393489 -0.215587 0.237790 0.233059 0.258588 0.256744 0.206244 0.303974 0.193891 0.212196 0.257933 0.196614 0.213632 0.230504 0.270519 0.230081 0.220222 0.254595 0.224013 0.236656 0.209925 0.249601 0.305268 0.231471 0.222625
chargesum: 0.00000
title: Mulliken charges with hydrogens summed into heavy atoms:
elementType: O N N N C C C C C C C C C C C C C C C C C
charge: -0.274132 -0.260464 -0.037148 -0.102275 0.012325 0.186632 0.186633 -0.060591 -0.119358 0.336070 0.370795 0.163748 0.262483 -0.067323 -0.083218 -0.159523 0.025773 -0.069580 -0.155868 -0.162018 0.007038
polarizability: 2.50300424e+02 3.30275046e+00 2.27762344e+02 -7.88316729e+00 1.63978541e+01 1.41486126e+02
1716.lowfreq: -14.4141 -9.2778 -0.0010 -0.0004 0.0003 9.1274 41.8521 61.9603 67.0237
frequency: 41.7403 61.8648 66.8464 87.4749 93.8817 102.4947 129.2227 157.3860 165.6839 187.5652 194.2098 205.6561 215.5851 227.4459 229.5201 247.5333 266.7891 273.9359 310.2232 328.8237 356.7828 362.8848 395.5229 409.8814 420.2088 447.9980 489.7412 498.1074 517.3437 541.3239 562.9773 586.3903 621.4603 631.5147 643.9178 663.3866 703.2086 716.3503 750.3689 751.7508 792.9291 801.4869 811.0056 820.3525 852.7324 883.9005 890.5486 896.4736 905.4861 923.8583 927.5151 957.4030 960.5864 979.3771 1023.1035 1026.4543 1053.6077 1072.0658 1093.5808 1096.6700 1113.6476 1118.3390 1126.7294 1144.2702 1153.6483 1173.5882 1189.5928 1198.4188 1201.7954 1207.9517 1243.2305 1252.9190 1265.2184 1271.9182 1284.3494 1312.1248 1316.3232 1331.3327 1346.1947 1350.5120 1363.2132 1373.6592 1374.5209 1384.9796 1392.0038 1413.6679 1417.1882 1438.6435 1456.2402 1461.8214 1464.4144 1466.0865 1470.1480 1471.6187 1479.7058 1482.1472 1488.2052 1491.5279 1509.4213 1548.3054 1564.5125 1596.4139 1617.0313 2934.0035 2966.8045 2971.3268 2977.7560 2987.3157 2994.6202 3000.1779 3004.6326 3037.4961 3056.6628 3058.7640 3065.7403 3073.3528 3077.9694 3079.9404 3088.6310 3088.8913 3127.5254 3142.0679 3160.9318 3218.0289 3495.4302 3610.7450
redmass: 3.9680 1.8983 1.5838 3.0054 3.1038 4.3262 2.9605 4.7053 3.0781 3.1875 1.1929 1.4468 2.6230 2.0922 1.2709 2.9079 4.6070 3.4514 3.3455 3.5310 4.5891 2.7903 3.4244 2.6496 2.5723 2.9941 3.8461 3.7745 1.3605 2.7742 4.8206 3.2209 2.9582 2.2121 4.8825 3.5773 3.9036 3.0759 4.6179 1.7907 2.8478 1.9856 3.2306 2.4191 2.5281 2.2856 1.6339 2.4102 1.9078 1.7465 1.4662 1.3303 1.4841 2.0669 2.5205 2.4052 2.0957 1.6895 2.2549 1.7765 1.4010 1.9535 1.7017 2.0914 1.8693 1.6186 1.8704 2.1453 1.8526 1.7436 1.6065 1.3586 1.8266 1.6253 2.1644 1.5239 1.6367 1.5998 1.6008 1.5614 2.4898 1.2137 4.5837 1.2666 1.2231 4.0262 2.4023 1.1930 1.3936 1.0850 1.0600 1.0678 1.0736 1.0747 1.1252 1.0615 2.1550 1.1204 1.1620 5.8989 6.3197 5.3948 6.7405 1.0389 1.0370 1.0383 1.0367 1.0823 1.0630 1.0976 1.0841 1.0865 1.0978 1.0986 1.0973 1.0976 1.0994 1.0969 1.0990 1.0996 1.0857 1.0919 1.0990 1.0982 1.0760 1.0809
irintensity: 0.4027 0.5304 0.8268 4.3014 0.2414 0.6739 1.6429 4.8224 2.0151 3.7303 0.0552 2.1815 3.0189 4.6660 0.6625 15.4887 5.5385 5.1415 4.0198 2.8783 4.1760 3.8999 3.5091 1.0070 3.3779 2.0436 2.8489 2.2051 79.1137 11.5101 5.3416 3.6910 21.5208 93.3385 1.6228 10.0872 17.5524 6.0271 21.1731 97.8785 16.7862 10.3333 3.9996 3.0311 3.3144 1.0811 1.4483 2.1950 7.2494 4.9769 6.0382 0.8973 0.7589 20.8160 27.7069 49.1820 21.7631 4.9869 12.5495 26.6373 5.4670 13.6476 7.7621 22.3921 10.4281 9.6141 3.2869 27.9246 14.3163 34.3856 1.8904 11.6985 36.6018 24.5534 7.2249 3.3093 5.7538 7.9731 4.4436 0.6009 25.3477 21.7700 32.4268 29.1069 27.2461 11.7817 16.0165 16.0927 75.2425 10.1133 3.1908 24.2430 10.0019 22.7772 28.5003 12.3118 56.2227 7.9114 25.9503 25.6988 16.2901 162.7344 9.4802 86.2496 25.6175 38.8145 23.6719 4.1961 42.0847 27.1763 16.8379 5.6351 7.5571 9.2066 83.3407 49.8858 49.1043 15.8809 30.7850 19.9056 1.5233 19.3520 23.1947 1.2564 7.5340 63.0301
temp: 298.150 k
press: 1.00000 atm
elementType: 8 7 7 7 6 6 6 6 6 6 6 6 6 6 6 6 6 6 6 6 6 1 1 1 1 1 1 1 1 1 1 1 1 1 1 1 1 1 1 1 1 1 1 1
symmnumber: 1
zpe: 974840.1 jmol-1
zpe.correction: 0.371297 hartree
zpe.thermalcorrener: 0.391712 hartree
zpe.thermalcorrenthalpy: 0.392656 hartree
zpe.thermalcorrgfe: 0.323911 hartree
zpe.sumelectzpe: -899.527524 hartree
zpe.sumelectthermal: -899.507110 hartree
zpe.sumelectthermalent: -899.506165 hartree
zpe.sumelectthermalfe: -899.574910 hartree
dipole: 5.1138 -1.4263 -1.2037
dipole: 5.4437
quadrupole: -109.7191 -127.1313 -127.0851
quadrupole: 8.9060 -0.3720 1.4012
quadrupole: 11.5928 -5.8195 -5.7733 8.9060 -0.3720 1.4012
hfenergy: -899.8988214 hartree
pointgroup: C01 [X(C17H23N3O1)]
dipole: -2.068773 -0.2820684 0.477076 debye
polarizability: 249.2700555|-6.3728849|226.8993821|-8.8102224|-20.1887293|143.3794558 unknown
InChI: InChI=1S/C17H23N3O/c1-10(2)16-17(21)19-11(3)8-12-9-18-13-6-5-7-14(15(12)13)20(16)4/h5-7,9-11,16,18-19H,8H2,1-4H3
charge 0 multiplicity 1
44 atoms
O  2.536892 1.806353 -0.671844
N  0.934655 -0.899259 -0.607881
N  0.737546 1.712019 0.814123
N  -3.772628 0.066979 -0.046489
C  1.96418 -0.38301 0.339881
C  3.394489 -0.9115 0.08511
C  -0.047518 2.759509 0.117942
C  -1.527075 -0.374606 -0.233491
C  -0.814049 2.096544 -1.089077
C  -0.373937 -1.233852 -0.114406
C  -1.777183 1.001648 -0.683191
C  1.842083 1.155153 0.174277
C  -2.804153 -0.914225 0.184415
C  4.371433 -0.310763 1.12329
C  3.429656 -2.454959 0.108544
C  -3.15295 1.210241 -0.558606
C  1.136705 -0.715778 -2.056635
C  -0.969102 3.49021 1.106069
C  -0.546095 -2.5005 0.493059
C  -2.968603 -2.190317 0.765494
C  -1.811082 -2.971479 0.939101
H  1.644511 -0.68635 1.356812
H  3.709605 -0.555036 -0.915591
H  0.685584 3.466577 -0.309822
H  -0.048604 1.723649 -1.792042
H  -1.368845 2.89604 -1.617776
H  0.18855 1.083243 1.40924
H  4.091023 -0.609811 2.152737
H  5.400352 -0.670488 0.939175
H  4.381976 0.79138 1.067301
H  3.178241 -2.841009 1.116344
H  4.439163 -2.824744 -0.149561
H  2.707869 -2.883978 -0.609323
H  -3.726318 2.106171 -0.79161
H  0.159748 -0.75385 -2.567827
H  1.771846 -1.520841 -2.482093
H  1.619676 0.254302 -2.289382
H  -1.716542 2.802967 1.545646
H  -0.378086 3.936035 1.925086
H  -1.518848 4.300005 0.593227
H  0.335516 -3.145698 0.573617
H  -4.767213 -0.035695 0.140958
H  -3.953604 -2.556052 1.075866
H  -1.887464 -3.967126 1.389732
