program: Gaussian 09
title: 000188533
version: EM64L-G09RevD.01
frameworkgroup: C1[X(C19H27N3O2)]
method: RPBEPBE
basis: SDD
operation: Freq
keyword: #p
keyword: freq=noraman
keyword: PBEPBE/SDD
title: #p freq=noraman PBEPBE/SDD
converged: YES YES NO NO
title: Mulliken charges:
elementType: O O N N N C C C C C C C C C C C C C C C C C C C H H H H H H H H H H H H H H H H H H H H H H H H H H H
charge: -0.267394 -0.436818 -0.259109 -0.166785 -0.348713 -0.226285 -0.078689 0.342717 -0.047783 -0.550482 -0.136784 0.332000 0.287812 0.156980 -0.433793 -0.401033 -0.401564 -0.732065 -0.723885 -0.675183 -0.384863 -0.373676 -0.236322 -0.663006 0.241494 0.233634 0.248136 0.223133 0.256776 0.280071 0.308815 0.221010 0.225258 0.248981 0.194268 0.212448 0.257748 0.197173 0.213843 0.230838 0.248593 0.231612 0.220816 0.235321 0.224830 0.223222 0.221142 0.235198 0.219258 0.232462 0.338644
chargesum: 0.00000
title: Mulliken charges with hydrogens summed into heavy atoms:
elementType: O O N N N C C C C C C C C C C C C C C C C C C C
charge: -0.267394 -0.098174 -0.259109 -0.166785 -0.039898 0.015209 -0.078689 0.342717 0.185851 -0.079213 0.119991 0.332000 0.287812 0.156980 -0.153722 0.045236 -0.152584 -0.067601 -0.082032 0.025838 -0.149542 0.074377 -0.015180 0.023912
polarizability: 2.95002503e+02 1.63795571e+00 2.49261679e+02 -3.35667115e+00 1.78759717e+01 1.60857029e+02
1716.lowfreq: -12.8641 -4.2166 -0.0005 0.0004 0.0005 6.4482 32.7871 43.8304 55.5226
frequency: 32.5811 43.7557 55.5162 60.1531 76.1085 84.9475 90.4171 111.6586 130.6690 142.5889 151.3471 173.6379 183.1710 195.0747 196.7495 199.8499 224.0196 227.1627 238.7721 250.8748 263.4037 276.4056 289.2317 309.7000 319.9772 324.9218 339.8108 384.7030 397.7387 415.5420 419.7545 426.9319 493.8538 511.9678 522.7592 545.7382 567.5537 583.3034 597.4373 641.1219 647.9175 659.7209 690.0528 714.8760 733.2765 751.3694 758.9664 789.6895 793.5948 812.5522 829.6185 835.7915 865.8535 876.7808 885.6807 914.8799 920.8864 930.1785 954.9936 960.2836 962.0149 979.9392 997.2642 1014.1838 1041.7563 1056.8666 1068.7154 1075.4322 1087.4318 1094.6624 1108.6518 1117.5254 1126.4395 1138.2366 1147.5547 1159.1261 1172.8657 1188.3559 1192.7600 1193.7034 1203.6509 1226.9143 1251.0935 1253.4773 1259.6355 1276.7790 1294.0521 1311.2600 1319.5663 1328.8658 1339.6742 1343.3172 1348.1874 1358.5791 1364.7561 1373.0794 1377.1355 1379.9820 1391.8037 1391.9949 1403.7376 1429.3263 1440.0807 1456.6634 1462.7022 1465.8631 1466.9929 1468.3994 1469.5642 1473.3273 1475.0192 1481.2487 1483.1750 1490.9171 1491.9559 1509.4588 1549.3142 1558.9060 1601.4591 1608.1767 2933.2222 2967.6846 2971.4386 2978.8547 2989.3353 2990.3846 2994.2677 3005.4136 3006.1327 3006.8499 3020.8036 3056.9567 3058.5833 3063.7083 3064.4730 3065.9079 3078.5586 3084.0312 3088.2111 3088.5067 3098.2947 3128.3077 3143.8763 3161.3020 3210.3701 3485.4048 3563.0290
redmass: 4.0911 4.3050 3.0160 3.5231 3.7489 3.8505 3.3603 3.7842 1.9469 1.9334 2.6986 2.3187 2.9395 1.5137 1.8499 1.5169 3.8281 2.7756 1.2451 2.8187 3.9604 2.7330 2.2566 3.3735 2.6333 1.4184 3.6941 3.0413 3.9771 3.1495 2.4807 3.6328 3.6430 3.3159 3.8985 3.9073 4.6575 3.5818 3.9845 5.0544 5.1131 2.2693 3.0819 2.3630 3.2548 1.9722 3.3362 2.1230 1.4636 1.6589 2.6808 2.8693 2.3611 2.5010 1.4737 2.3326 1.4987 1.8523 1.3320 1.6410 2.1467 3.0862 2.4061 2.0887 2.6584 2.1873 2.1978 2.3798 1.8892 2.1318 1.8140 1.5856 1.6502 1.4531 2.1692 1.9824 1.5861 1.8508 2.2049 1.4437 2.1620 1.4087 1.4858 1.4008 1.6446 1.6624 1.2995 1.4546 1.9103 1.5663 1.5750 1.5460 1.3891 1.6406 2.8663 1.2211 2.5467 1.3213 1.2492 1.2250 3.8653 4.4696 1.1998 1.1422 1.3523 1.0527 1.1046 1.0499 1.0779 1.1455 1.4577 1.4849 1.0679 1.1305 1.0639 1.1113 5.6197 6.8822 5.3282 7.1362 1.0376 1.0369 1.0383 1.0634 1.0355 1.0825 1.0997 1.0627 1.0610 1.0844 1.0824 1.0979 1.1029 1.1004 1.1012 1.0973 1.0994 1.0961 1.0994 1.0991 1.1022 1.0855 1.0917 1.0988 1.0981 1.0758 1.0662
irintensity: 0.3534 2.3598 0.7999 0.4079 1.5273 1.5168 0.4976 0.9067 3.8274 2.4740 5.6753 1.2765 3.5632 4.4664 3.6477 2.3351 1.0103 1.6352 0.7208 15.5514 3.1368 10.5604 8.2790 2.5282 24.6225 119.5160 7.2106 0.7880 5.5449 5.8985 6.2461 18.6386 9.5384 7.1687 0.9054 0.8006 1.4102 7.3312 6.6124 19.9015 4.0696 49.2603 3.3504 46.6790 8.1053 88.6908 35.5461 11.6802 6.4419 8.8370 0.2784 14.9656 0.7439 7.9163 0.4367 21.7271 1.6145 14.0837 0.8639 7.8396 10.8070 96.9264 30.2572 13.2367 15.3900 3.8746 6.4782 18.1193 9.6440 20.0895 25.5611 2.8684 14.4576 31.5134 16.2948 19.8390 10.1586 1.6821 31.1708 33.7909 15.1723 11.5180 1.2894 18.3074 32.9346 49.9970 7.7691 0.8849 63.3352 7.4596 9.1781 17.6676 12.7764 2.7417 7.6096 18.1356 27.6283 11.0326 25.4593 30.3269 24.6399 47.2751 9.3230 24.9593 61.6640 5.1166 35.5092 10.1272 7.8259 49.9349 18.5037 24.0245 10.3856 31.5276 13.9231 17.7558 42.2516 24.2936 165.1693 8.1032 83.0358 24.8090 38.9944 49.6725 23.2786 5.4959 37.4933 13.5032 46.6715 19.4102 26.8925 6.5716 4.0354 22.1513 13.5646 88.8553 47.9130 19.1691 52.7020 23.1298 28.2997 2.2868 20.1705 22.6028 0.2897 9.5469 5.7476
temp: 298.150 k
press: 1.00000 atm
elementType: 8 8 7 7 7 6 6 6 6 6 6 6 6 6 6 6 6 6 6 6 6 6 6 6 1 1 1 1 1 1 1 1 1 1 1 1 1 1 1 1 1 1 1 1 1 1 1 1 1 1 1
symmnumber: 1
zpe: 1131878.8 jmol-1
zpe.correction: 0.431110 hartree
zpe.thermalcorrener: 0.455524 hartree
zpe.thermalcorrenthalpy: 0.456468 hartree
zpe.thermalcorrgfe: 0.378313 hartree
zpe.sumelectzpe: -1053.101345 hartree
zpe.sumelectthermal: -1053.076931 hartree
zpe.sumelectthermalent: -1053.075987 hartree
zpe.sumelectthermalfe: -1053.154141 hartree
dipole: 3.9511 -1.5722 -1.0002
dipole: 4.3684
quadrupole: -135.9028 -142.0174 -144.2487
quadrupole: 0.8164 1.1835 2.5324
quadrupole: 4.8202 -1.2944 -3.5257 0.8164 1.1835 2.5324
hfenergy: -1053.5324547 hartree
pointgroup: C01 [X(C19H27N3O2)]
dipole: 1.6359446 0.3220886 0.4168638 debye
polarizability: 293.2495451|-9.3982511|247.8134224|5.2829508|23.9319609|164.0582436 unknown
InChI: InChI=1S/C19H27N3O2/c1-5-22-10-13-9-14(11-23)20-19(24)18(12(2)3)21(4)15-7-6-8-16(22)17(13)15/h6-8,10,12,14,18,20,23H,5,9,11H2,1-4H3
charge 0 multiplicity 1
51 atoms
O  -3.12175 -1.546439 -0.528963
O  1.156265 -4.416429 0.017953
N  -1.441437 1.140642 -0.537985
N  3.29098 0.085007 -0.381881
N  -1.162682 -1.517192 0.743589
C  -2.398991 0.608842 0.47123
C  1.034715 0.572427 -0.384735
C  1.22392 -0.783733 -0.908345
C  -3.836151 1.169227 0.352567
C  0.21963 -1.842037 -1.306676
C  -0.479455 -2.536649 -0.085354
C  -0.089801 1.442393 -0.143046
C  2.352892 1.067497 -0.037478
C  -2.327195 -0.926493 0.246959
C  2.600393 -1.021964 -0.884892
C  0.490304 -3.353638 0.788203
C  0.14964 2.681386 0.497427
C  -4.735166 0.553931 1.450772
C  -3.838601 2.711489 0.426358
C  -1.772333 1.02159 -1.969088
C  2.578998 2.316249 0.583141
C  4.741389 0.153838 -0.142122
C  1.453113 3.111255 0.867458
C  5.140746 -0.273203 1.287871
H  -1.994125 0.869329 1.469087
H  -4.238408 0.849241 -0.628847
H  -0.578778 -1.430764 -1.948956
H  0.731797 -2.631938 -1.887137
H  -1.272084 -3.200436 -0.481211
H  3.130685 -1.925396 -1.184703
H  -0.534606 -0.893934 1.262699
H  -0.057361 -3.765055 1.660806
H  1.320221 -2.722237 1.151182
H  -0.711268 3.336103 0.670398
H  -4.35507 0.804608 2.460995
H  -5.764782 0.948891 1.373613
H  -4.785222 -0.544338 1.35567
H  -3.500604 3.060037 1.422313
H  -4.8580 3.106497 0.261591
H  -3.167906 3.152234 -0.332682
H  -2.252128 0.051347 -2.211555
H  -0.847647 1.114136 -2.562884
H  -2.464117 1.827629 -2.292008
H  3.587219 2.654825 0.843957
H  5.23791 -0.496249 -0.884832
H  5.07982 1.187018 -0.342641
H  1.58227 4.085728 1.351197
H  4.659263 0.371311 2.04383
H  6.236015 -0.199615 1.416782
H  4.839055 -1.317078 1.483347
H  0.476827 -5.082588 -0.257574
