program: Gaussian 09
title: 000188532
version: EM64L-G09RevD.01
frameworkgroup: C1[X(C18H25N3O2)]
method: RPBEPBE
basis: SDD
operation: Freq
keyword: #p
keyword: freq=noraman
keyword: PBEPBE/SDD
title: #p freq=noraman PBEPBE/SDD
converged: YES YES NO NO
title: Mulliken charges:
elementType: O O N N N C C C C C C C C C C C C C C C C C C H H H H H H H H H H H H H H H H H H H H H H H H H
charge: -0.267908 -0.436785 -0.259553 -0.348679 -0.154561 -0.226828 -0.047226 -0.072317 -0.137225 0.347768 -0.549632 0.332185 0.266713 0.157422 -0.434363 -0.400917 -0.731811 -0.723814 -0.676029 -0.400592 -0.377567 -0.230246 -0.636672 0.241125 0.233204 0.257039 0.249096 0.222737 0.308607 0.280413 0.220957 0.226481 0.194375 0.212560 0.257694 0.197237 0.213946 0.230798 0.249934 0.231496 0.220825 0.248870 0.237813 0.221584 0.237589 0.235476 0.240160 0.338622
chargesum: 0.00000
title: Mulliken charges with hydrogens summed into heavy atoms:
elementType: O O N N N C C C C C C C C C C C C C C C C C C
charge: -0.267908 -0.098163 -0.259553 -0.040073 -0.154561 0.014297 0.185979 -0.072317 0.119813 0.347768 -0.077799 0.332185 0.266713 0.157422 -0.153950 0.046521 -0.067182 -0.081832 0.026225 -0.151722 -0.139754 -0.008662 0.076553
polarizability: 2.76863309e+02 2.74836206e-01 2.41867837e+02 -4.97973265e+00 2.01054688e+01 1.51349560e+02
1716.lowfreq: -9.3254 -7.3759 -1.8774 -0.0006 -0.0004 0.0006 37.7878 53.1446 59.4063
frequency: 37.7449 53.1332 59.4053 80.8309 86.1219 87.2860 96.9859 113.3161 137.8979 140.0650 154.6350 176.0116 183.9832 189.6225 199.3285 219.6101 230.0270 237.3296 244.9224 258.6568 269.1804 289.9674 317.5936 321.2610 342.2403 356.0820 385.0669 406.0502 418.3059 422.4315 488.1460 514.3629 525.5316 541.4369 563.8106 579.8449 600.2007 639.4942 648.7216 655.0343 692.0527 712.1760 737.9759 751.7204 762.4208 792.6690 809.5196 830.1534 836.9453 869.2871 877.7706 889.5101 915.1966 922.5952 948.7225 957.2613 960.8280 975.7636 990.2270 1014.3365 1042.4848 1046.0095 1062.1223 1073.9381 1091.4642 1108.0522 1117.7838 1119.2487 1127.0615 1139.1864 1146.6125 1156.9049 1174.1427 1189.3079 1195.7618 1198.5800 1206.0165 1228.1458 1257.8783 1260.8585 1280.1911 1293.2445 1314.8425 1316.1222 1329.7635 1341.1112 1349.8123 1350.5234 1360.2459 1370.2066 1372.2074 1380.2819 1390.9409 1401.8326 1418.5389 1438.2767 1456.0392 1459.3595 1463.7409 1465.2224 1466.8500 1467.9161 1469.7893 1473.2963 1478.2904 1481.7087 1490.4945 1496.2851 1508.0367 1550.1070 1559.5815 1601.5146 1609.8806 2932.9411 2967.1706 2970.8234 2977.4512 2980.0497 2990.9795 2996.1289 3007.3587 3007.6741 3021.5970 3054.2623 3056.9915 3065.9682 3066.6056 3067.5930 3078.2174 3082.3937 3087.5008 3108.5786 3129.7891 3145.4985 3162.2478 3213.3007 3486.2448 3562.3481
redmass: 4.5039 4.3604 3.7298 2.4936 1.7299 3.8727 1.9194 1.1618 3.3477 3.4955 3.2616 3.0232 2.4391 1.1473 3.5785 1.8516 2.0403 3.2856 3.0667 3.6340 3.9925 3.0141 3.2450 1.3489 3.5582 3.7646 2.9358 4.3891 2.5940 2.7513 3.5141 3.3367 4.5709 3.6785 4.8116 3.7808 4.0866 5.3071 4.1719 2.3431 3.1591 2.5023 3.3651 2.0622 3.6157 2.8783 1.6238 2.6931 3.0724 2.5425 2.4803 1.4410 2.2656 1.2607 2.1905 1.3404 1.7390 3.1212 2.4699 2.1001 2.6467 1.8911 2.0488 2.3816 2.2258 1.7692 1.6214 1.3061 1.7926 1.3523 2.3493 1.8534 1.6739 1.9299 2.2691 1.4341 2.0769 1.4128 1.4157 1.5190 1.6761 1.3205 1.4871 1.9518 1.4397 1.7016 2.0254 2.3138 1.7900 2.5570 1.2148 1.3075 1.2262 5.8212 2.2098 1.2086 1.6095 1.2718 1.1560 1.1823 1.0787 1.0428 1.0836 1.1510 2.0627 1.0643 1.0527 1.1704 1.1253 5.5199 6.8190 5.2029 7.0572 1.0384 1.0368 1.0383 1.0357 1.0636 1.0823 1.0992 1.0841 1.0642 1.0813 1.1018 1.0978 1.0972 1.1000 1.1009 1.0994 1.0963 1.0992 1.0986 1.0855 1.0917 1.0991 1.0982 1.0756 1.0662
irintensity: 0.4352 3.2067 1.3658 2.1274 0.1537 0.3751 0.3501 1.9208 7.5714 0.7389 8.6959 1.8302 0.7325 0.4813 9.4963 0.1547 0.6856 2.4557 8.9757 6.7527 2.2557 29.5994 2.0119 103.4975 11.9080 29.5014 1.4929 4.0272 0.6467 25.6700 12.3190 8.2357 1.6441 0.7490 2.0657 8.1779 5.3167 18.0596 7.8368 59.3626 3.0124 42.7927 10.7707 103.2142 12.3266 16.7712 11.1561 1.1450 14.7642 1.8671 7.1081 0.7123 22.0868 3.2040 0.9070 0.9642 9.0141 62.0691 82.4655 11.3557 13.8267 3.8062 4.3403 27.5260 20.3585 22.6922 3.9802 0.6746 12.9222 33.0591 15.8519 13.0101 11.2440 2.2120 39.8743 5.9376 16.4957 10.3775 35.4229 9.1576 41.4940 9.0872 8.2899 49.2423 4.8840 7.7637 1.0385 24.2767 6.4374 6.4572 20.6175 9.3286 27.1928 23.0673 35.6353 9.4600 21.6161 46.6746 20.8951 45.6754 7.1932 14.7550 6.9533 46.0660 47.3361 11.4832 25.8518 23.1504 22.2070 36.6257 24.8542 162.1803 6.9154 84.7890 24.8380 39.5387 83.3943 49.7049 4.1252 35.4040 13.5796 18.0445 29.1839 26.3126 6.8070 81.8766 23.9855 15.8589 45.7532 18.4147 27.1320 9.9238 2.8347 16.9183 23.5035 0.2534 9.2690 5.8921
temp: 298.150 k
press: 1.00000 atm
elementType: 8 8 7 7 7 6 6 6 6 6 6 6 6 6 6 6 6 6 6 6 6 6 6 1 1 1 1 1 1 1 1 1 1 1 1 1 1 1 1 1 1 1 1 1 1 1 1 1
symmnumber: 1
zpe: 1058015.2 jmol-1
zpe.correction: 0.402977 hartree
zpe.thermalcorrener: 0.426222 hartree
zpe.thermalcorrenthalpy: 0.427167 hartree
zpe.thermalcorrgfe: 0.351825 hartree
zpe.sumelectzpe: -1013.875790 hartree
zpe.sumelectthermal: -1013.852545 hartree
zpe.sumelectthermalent: -1013.851600 hartree
zpe.sumelectthermalfe: -1013.926942 hartree
dipole: 3.6904 -1.8263 -1.1006
dipole: 4.2621
quadrupole: -127.9984 -135.4254 -137.8329
quadrupole: -0.1734 1.1037 2.4002
quadrupole: 5.7538 -1.6731 -4.0807 -0.1734 1.1037 2.4002
hfenergy: -1014.2787669 hartree
pointgroup: C01 [X(C18H25N3O2)]
dipole: 1.5873758 0.314489 0.4395092 debye
polarizability: 274.8022879|-8.9071119|241.4229546|8.102944|24.0354471|153.855464 unknown
InChI: InChI=1S/C18H25N3O2/c1-11(2)17-18(23)19-13(10-22)8-12-9-20(3)14-6-5-7-15(16(12)14)21(17)4/h5-7,9,11,13,17,19,22H,8,10H2,1-4H3
charge 0 multiplicity 1
48 atoms
O  -2.896415 -1.489932 -0.63487
O  1.265127 -4.46384 0.176301
N  -1.157823 1.155151 -0.56467
N  -1.017963 -1.502661 0.75403
N  3.524412 -0.028072 -0.108151
C  -2.180952 0.652398 0.395365
C  -3.595182 1.247006 0.19732
C  1.289532 0.522898 -0.267158
C  -0.315845 -2.546775 -0.02746
C  1.47393 -0.843433 -0.765631
C  0.466363 -1.878853 -1.213184
C  0.17753 1.425017 -0.098164
C  2.596666 0.9865 0.155119
C  -2.134131 -0.885208 0.184504
C  2.839024 -1.119753 -0.651254
C  0.585731 -3.378977 0.902969
C  -4.568437 0.656531 1.244779
C  -3.563672 2.789058 0.268494
C  -1.410358 1.030523 -2.011444
C  0.414992 2.664995 0.542052
C  2.824294 2.236818 0.770999
C  1.706217 3.065628 0.981064
C  4.959564 0.046815 0.166557
H  -1.822774 0.910189 1.411684
H  -3.951274 0.935248 -0.804419
H  -1.101432 -3.194713 -0.461563
H  -0.285114 -1.450142 -1.899165
H  0.98797 -2.685057 -1.761664
H  -0.404275 -0.89203 1.304325
H  3.361376 -2.041709 -0.904408
H  -0.016705 -3.769879 1.748432
H  1.410271 -2.763917 1.303674
H  -4.241953 0.904319 2.274223
H  -5.583369 1.07226 1.1069
H  -4.635953 -0.440962 1.151124
H  -3.275159 3.132482 1.281649
H  -4.561525 3.208919 0.044047
H  -2.839128 3.209655 -0.451473
H  -1.916061 0.077742 -2.268856
H  -0.449748 1.074456 -2.551739
H  -2.046026 1.860746 -2.384436
H  -0.43647 3.344132 0.658809
H  3.82678 2.549505 1.08148
H  1.833634 4.043062 1.459231
H  5.149451 0.215717 1.242945
H  5.43562 -0.902669 -0.124908
H  5.432449 0.865405 -0.407034
H  0.584909 -5.114993 -0.131329
