program: Gaussian 09
title: 000188530
version: EM64L-G09RevD.01
frameworkgroup: C1[X(C15H19ClO4)]
method: RPBEPBE
basis: SDD
operation: Freq
keyword: #p
keyword: freq=noraman
keyword: PBEPBE/SDD
title: #p freq=noraman PBEPBE/SDD
converged: YES YES NO NO
title: Mulliken charges:
elementType: Cl O O O O C C C C C C C C C C C C C C C H H H H H H H H H H H H H H H H H H H
charge: -0.029158 -0.252839 -0.229299 -0.419241 -0.238178 -0.023671 -0.556756 -0.515716 -0.737510 0.111825 0.314728 0.170008 -0.297124 -0.389488 0.498155 0.019069 -0.375012 -0.354061 -0.685530 -0.685753 0.250180 0.229805 0.242922 0.236315 0.300941 0.254509 0.196838 0.210967 0.272375 0.280406 0.203387 0.248084 0.219119 0.243095 0.235626 0.207296 0.238532 0.231355 0.373797
chargesum: 0.00000
title: Mulliken charges with hydrogens summed into heavy atoms:
elementType: Cl O O O O C C C C C C C C C C C C C C C
charge: -0.029158 -0.252839 -0.229299 -0.045444 -0.238178 0.226509 -0.084029 0.021540 -0.075195 0.111825 0.314728 0.170008 -0.024749 -0.109082 0.498155 0.222456 -0.375012 -0.105977 0.012309 -0.008570
polarizability: 2.93483106e+02 6.30809079e+00 1.77615516e+02 1.07109607e+01 2.68141708e+00 1.23076157e+02
1716.lowfreq: -9.0805 -0.0017 -0.0015 -0.0010 3.6535 4.6416 16.5518 25.2351 40.3693
frequency: 16.0357 24.9775 40.3574 43.0395 52.2225 59.7160 83.7403 102.8514 114.2633 118.9016 161.3201 174.8639 175.6664 179.0159 190.2416 217.4249 230.1274 275.9715 301.3198 305.4320 313.2264 343.3313 359.4345 385.8950 409.2725 435.4189 442.3701 461.9229 474.3562 505.7264 510.3991 543.2518 597.2430 607.9559 627.5043 646.9922 684.2492 729.8714 736.9008 814.6217 821.6314 833.1589 861.2520 865.8647 884.8265 890.6774 918.4446 925.0225 927.8083 938.8111 954.1492 982.2709 1013.6665 1033.0962 1037.2209 1095.0817 1098.3644 1099.2912 1147.0748 1153.4796 1156.1361 1182.6622 1186.6251 1221.7567 1237.6449 1246.8696 1255.5549 1265.4073 1297.2319 1318.0775 1324.5107 1342.7886 1344.9564 1360.2748 1369.0810 1382.4574 1391.3903 1398.7442 1413.8031 1430.2876 1434.7984 1454.6202 1467.2633 1469.2871 1473.8751 1485.0729 1488.0104 1489.2639 1543.5374 1576.9091 1612.9238 1665.8574 2956.5420 2971.9128 2986.4689 2991.6425 2995.1631 2997.3952 3003.4863 3023.6985 3052.8414 3064.5549 3087.9805 3090.1279 3095.8249 3099.5789 3107.2077 3152.9044 3167.5093 3173.3111 3508.9727
redmass: 5.9142 5.5434 5.9096 5.3862 4.0016 3.4199 4.5602 4.0935 4.5190 5.8068 3.8694 1.6593 2.0414 2.4087 4.0484 1.1781 1.1968 3.2455 4.8520 3.7406 3.4702 9.2491 2.8600 2.9193 4.3245 2.5007 3.3637 3.0039 3.8919 2.8065 2.4413 4.5157 4.1780 3.0341 6.5230 1.4173 6.1062 3.9780 4.5878 3.9288 1.9198 2.1613 2.9151 2.6141 1.6352 1.8831 3.1355 1.9824 1.3244 1.3525 2.0977 1.3524 2.3362 3.0078 2.2224 1.9412 1.6894 2.2115 1.4430 1.9023 1.8829 1.9303 1.3788 1.8679 1.3630 3.1399 1.4272 1.3833 1.7518 1.3417 1.5596 1.5785 1.7169 3.4520 1.6955 1.2497 1.2276 1.2188 5.7582 1.1140 1.1202 1.0484 1.0502 1.0575 1.0601 2.0275 1.2223 1.0522 7.6322 7.7288 7.5610 8.0679 1.0605 1.0381 1.0836 1.0364 1.0601 1.0368 1.0937 1.0874 1.0990 1.0977 1.0992 1.0983 1.1005 1.0998 1.1006 1.0878 1.0917 1.0956 1.0638
irintensity: 0.1602 1.6306 0.8684 0.5288 0.4845 0.3977 0.4453 4.0633 2.3797 1.3456 3.0872 2.4780 0.3381 2.7891 2.0050 0.1079 2.0505 1.2588 0.1803 0.2335 9.9608 6.9248 1.4027 6.9731 1.9550 2.1653 1.4438 12.2645 35.6942 12.3878 20.3912 1.6639 5.7134 3.1616 28.7819 126.6135 32.2131 4.8568 3.2838 43.5704 43.1871 2.6691 6.5860 0.1378 18.0757 26.8475 60.0511 10.1690 12.7159 3.4887 79.0615 0.5898 37.2079 47.4052 262.4478 43.5475 106.7156 6.0277 49.0933 41.4049 7.3407 58.6736 9.4948 228.5054 7.1731 360.7407 16.6660 24.8634 133.7084 6.7947 20.4075 18.0832 35.0463 81.4187 75.4649 30.3366 15.7893 29.8681 2.9259 31.8363 13.1212 5.3974 2.7818 9.5340 12.0202 43.6931 16.5590 20.0998 87.7504 225.0164 95.2183 206.2366 30.6676 30.4577 24.9103 12.5458 19.0095 20.8568 6.2665 7.5597 7.4690 49.1120 19.0459 27.3732 23.1038 32.0575 30.2659 1.4455 3.8512 12.2653 20.0506
temp: 298.150 k
press: 1.00000 atm
elementType: 17 8 8 8 8 6 6 6 6 6 6 6 6 6 6 6 6 6 6 6 1 1 1 1 1 1 1 1 1 1 1 1 1 1 1 1 1 1 1
symmnumber: 1
zpe: 812225.1 jmol-1
zpe.correction: 0.309360 hartree
zpe.thermalcorrener: 0.331143 hartree
zpe.thermalcorrenthalpy: 0.332087 hartree
zpe.thermalcorrgfe: 0.255696 hartree
zpe.sumelectzpe: -1342.447193 hartree
zpe.sumelectthermal: -1342.425411 hartree
zpe.sumelectthermalent: -1342.424467 hartree
zpe.sumelectthermalfe: -1342.500857 hartree
dipole: 4.4654 -0.6785 1.1091
dipole: 4.6508
quadrupole: -113.5885 -124.9571 -129.4078
quadrupole: -20.1140 -10.3294 -3.5239
quadrupole: 9.0626 -2.3059 -6.7567 -20.1140 -10.3294 -3.5239
hfenergy: -1342.7565536 hartree
pointgroup: C01 [X(C15H19Cl1O4)]
dipole: 1.729788 -0.4529351 0.3882112 debye
polarizability: 291.4562084|-2.1053136|166.188873|21.9423735|22.058302|136.529697 unknown
InChI: InChI=1S/C15H19ClO4/c1-9(2)20-14-5-4-11(8-12(14)16)13(17)6-10(3)7-15(18)19/h4-5,8-10,18H,6-7H2,1-3H3
charge 0 multiplicity 1
39 atoms
Cl 2.916684 2.253646 1.9163
O  4.340353 -0.128068 0.917417
O  -1.771869 -1.215805 -0.89396
O  -6.383071 -1.440831 1.150719
O  -6.292004 -0.303041 -0.867739
C  -3.65516 0.81669 -0.172379
C  -2.156604 0.943005 0.188633
C  -4.310749 -0.3317 0.631117
C  -4.373938 2.164078 0.070624
C  -1.278142 -0.231358 -0.261876
C  0.186152 -0.191514 0.046219
C  -5.726045 -0.645323 0.194146
C  0.794812 0.885247 0.750297
C  1.006449 -1.269048 -0.380148
C  2.999974 -0.209204 0.585368
C  5.298198 -1.187924 0.457831
C  2.169533 0.86814 1.010264
C  2.386185 -1.28235 -0.121404
C  5.644509 -0.966846 -1.023659
C  6.503771 -1.044675 1.389891
H  -3.736197 0.556648 -1.244692
H  -2.040107 1.083204 1.284385
H  -1.749265 1.866764 -0.272552
H  -4.319133 -0.115225 1.71655
H  -3.724521 -1.260473 0.4911
H  -5.437106 2.097314 -0.216431
H  -4.317501 2.461814 1.136139
H  -3.915293 2.970938 -0.530862
H  0.205875 1.73836 1.098146
H  0.530347 -2.092777 -0.92168
H  4.820131 -2.176729 0.611629
H  2.987164 -2.127915 -0.466447
H  6.350459 -1.745353 -1.365688
H  4.751048 -1.005875 -1.670097
H  6.123567 0.018881 -1.155112
H  7.269447 -1.799938 1.137381
H  6.203272 -1.184127 2.441791
H  6.950828 -0.040963 1.286554
H  -7.293049 -1.663871 0.812424
