program: Gaussian 09
title: 000196617
version: EM64L-G09RevD.01
frameworkgroup: C1[X(C20H26O3)]
method: RPBEPBE
basis: SDD
operation: Freq
keyword: #pfreq=noraman
keyword: PBEPBE/SDD
title: #p freq=noraman PBEPBE/SDD
converged: NO YES NO NO
title: Mulliken charges:
elementType: O O O C C C C C C C C C C C C C C C C C C C C H H H H H H H H H H H H H H H H H H H H H H H H H H
charge: -0.297764 -0.177545 -0.229036 -0.163299 -0.130848 0.269018 -0.145217 0.310796 -0.519382 -0.129926 -0.527326 -0.478820 0.524865 -0.541753 -0.557617 -0.650135 0.041828 -0.509641 -0.393183 -0.798054 -0.563369 -0.581480 0.183140 0.217409 0.242029 0.221754 0.262099 0.230984 0.232403 0.211570 0.230461 0.227814 0.219068 0.233590 0.216626 0.225066 0.250709 0.220466 0.239786 0.248361 0.248323 0.223893 0.220727 0.224561 0.244255 0.243785 0.249475 0.221133 0.258403
chargesum: 0.00000
title: Mulliken charges with hydrogens summed into heavy atoms:
elementType: O O O C C C C C C C C C C C C C C C C C C C C
charge: -0.297764 -0.177545 -0.229036 0.054111 0.111181 0.269018 0.076537 0.310796 -0.026300 0.102477 -0.085296 -0.031938 0.524865 -0.091536 -0.081842 -0.189883 0.041828 -0.012957 0.051437 -0.085452 -0.092762 -0.323078 0.183140
polarizability: 2.68564146e+02 3.60773780e+00 1.95605744e+02 1.26279147e+01 -3.99044437e+00 1.74981033e+02
1716.lowfreq: -12.8282 -0.0006 -0.0002 0.0005 8.3173 12.4264 33.4284 42.9671 64.4132
frequency: 33.2773 42.5980 64.3702 79.1773 96.6594 128.1040 143.1745 149.6486 170.0920 183.0534 188.0921 218.7996 228.5658 253.3819 265.2949 270.9177 282.8800 283.6489 313.3839 359.8580 371.8933 372.6712 398.3341 409.9760 426.5448 461.7368 475.9929 515.4134 520.6351 534.8068 536.5242 558.7963 572.9653 595.4799 619.0871 640.5214 662.0634 696.1406 732.1057 748.5493 775.5544 804.4416 821.1559 824.4127 840.4362 846.2248 864.0785 882.8474 894.7203 913.2826 928.9809 939.9070 960.6107 968.2346 986.3425 994.8015 1006.2547 1012.9583 1016.8988 1020.1578 1033.1210 1045.4981 1049.6383 1074.5737 1081.5467 1088.6207 1104.0150 1113.0021 1117.3180 1124.9397 1131.5998 1138.3577 1164.1976 1169.2085 1177.2695 1195.0051 1199.3906 1203.5411 1221.6496 1229.1211 1240.6478 1251.3610 1257.1177 1262.9629 1271.3250 1279.1052 1281.3691 1290.3298 1304.5328 1312.8380 1320.3544 1325.8908 1333.5560 1338.5330 1343.5437 1347.8595 1354.8663 1359.1983 1366.2058 1382.6514 1384.3202 1426.8645 1445.0771 1462.1260 1464.3562 1471.0990 1474.2012 1477.5970 1478.2389 1487.5470 1487.9995 1496.6118 1587.0109 1628.3391 1654.9238 2906.8244 2921.1394 2957.9595 2961.5184 2972.4709 2978.2836 2988.8135 2989.6806 2993.3647 2997.5258 3003.0939 3015.9854 3037.0419 3045.0108 3045.2378 3051.6893 3057.0975 3064.9517 3071.0103 3074.9658 3076.8849 3078.5288 3086.5023 3095.1291 3119.8297 3185.5853
redmass: 5.1531 5.7393 5.1435 3.5810 3.0017 5.1173 2.1009 3.6766 3.6756 3.3136 2.5617 2.1037 2.3767 2.4041 2.3115 2.8161 4.0212 2.8382 3.1710 3.2766 4.2683 2.6166 3.3081 2.7787 3.6241 3.6980 2.9898 3.1091 2.4918 2.8392 2.5627 3.0047 3.7810 3.3422 3.8978 3.3440 3.4395 2.8624 3.3456 7.1501 2.0074 2.1705 1.8165 2.1435 3.0935 2.4129 2.2473 1.8206 1.9293 1.8204 1.7432 1.7524 2.4148 2.2572 2.2004 2.1237 2.0297 1.9154 1.8208 1.4158 1.8110 2.3480 2.5056 2.5592 2.6959 2.1135 2.2435 1.8830 1.3463 1.9862 1.3698 1.7381 2.1459 1.5420 1.6291 1.4577 1.5234 2.0153 1.9672 1.4807 1.6427 1.4062 1.7095 1.7240 1.5418 1.3429 2.1372 1.4968 1.3361 1.3763 1.4125 1.4164 1.4719 2.1508 1.3614 1.3926 1.4086 1.4216 1.4845 1.1924 1.5707 1.0794 1.0845 1.0693 1.0842 1.0927 1.0878 1.0919 1.0887 1.1493 1.0754 1.0659 9.9348 7.8008 12.0361 1.0805 1.0814 1.0671 1.0782 1.0656 1.0626 1.0368 1.0646 1.0609 1.0592 1.0662 1.0627 1.0983 1.0984 1.0964 1.0976 1.0984 1.0979 1.1015 1.0997 1.0584 1.0992 1.0850 1.0978 1.0912 1.1162
irintensity: 1.2887 4.3730 3.5786 2.2391 3.7859 2.2929 0.3493 5.3601 1.0565 2.2869 0.8007 0.8890 0.6108 0.5318 0.8588 0.2725 2.3515 0.9107 2.3233 3.7662 7.0317 3.6574 0.7190 1.4712 0.5631 11.0221 0.7319 3.6779 1.4092 1.0209 1.8253 2.9363 4.3036 0.9233 1.7888 1.6399 3.7053 1.0163 12.7926 15.3352 10.4839 0.7593 6.6507 6.0374 22.7020 4.2443 8.1941 20.1383 3.3140 6.0451 16.7942 3.0589 3.7656 7.6428 9.8447 5.9309 20.5963 20.7661 6.9360 5.1970 3.7750 6.0666 20.5635 3.1026 1.1650 9.8933 5.8019 1.0851 6.2162 11.1750 7.0952 5.7989 5.0343 1.2681 15.5442 15.2459 1.4676 2.3145 5.1866 28.9161 16.6570 1.6481 2.8014 6.7878 4.0072 2.4546 36.9562 1.5906 5.3282 0.7893 2.0237 3.4051 1.4768 16.4151 1.0742 0.2220 1.7672 5.9907 11.1679 18.1602 5.3776 18.6021 13.1844 5.2945 4.7235 17.6535 12.0837 8.8912 7.1604 8.7828 10.2473 6.9884 163.7658 189.6181 188.0274 11.3159 15.3419 18.9470 9.2336 47.2640 33.8538 15.2668 10.4760 28.0984 32.2562 13.0712 16.5846 44.7758 25.8521 24.5821 18.8295 14.2985 17.9998 26.3423 41.1814 31.3685 12.5618 26.0692 23.0180 9.3786 20.5583
temp: 298.150 k
press: 1.00000 atm
elementType: 8 8 8 6 6 6 6 6 6 6 6 6 6 6 6 6 6 6 6 6 6 6 6 1 1 1 1 1 1 1 1 1 1 1 1 1 1 1 1 1 1 1 1 1 1 1 1 1 1
symmnumber: 1
zpe: 1094558.0 jmol-1
zpe.correction: 0.416895 hartree
zpe.thermalcorrener: 0.437561 hartree
zpe.thermalcorrenthalpy: 0.438505 hartree
zpe.thermalcorrgfe: 0.368809 hartree
zpe.sumelectzpe: -1001.604540 hartree
zpe.sumelectthermal: -1001.583875 hartree
zpe.sumelectthermalent: -1001.582931 hartree
zpe.sumelectthermalfe: -1001.652626 hartree
dipole: 0.7789 -1.3796 4.2442
dipole: 4.5303
quadrupole: -178.5736 -140.2063 -137.1675
quadrupole: -20.6274 -1.6374 -3.6994
quadrupole: -26.5911 11.7761 14.8150 -20.6274 -1.6374 -3.6994
hfenergy: -1002.0214356 hartree
pointgroup: C01 [X(C20H26O3)]
dipole: -0.2952368 1.0003691 1.4452881 debye
polarizability: 268.0022123|0.9510177|196.092582|-14.9197949|-2.6770025|175.0561295 unknown
InChI: InChI=1S/C20H26O3/c1-19-8-7-16-14(15(19)4-5-17(19)22)3-2-12-10-13(21)6-9-20(12,16)18-11-23-18/h10,14-16,18H,2-9,11H2,1H3
charge 0 multiplicity 1
49 atoms
O  1.279522 -2.118726 1.967162
O  -5.18745 -1.143502 -1.086122
O  5.109491 0.910649 -1.913137
C  -0.01581 -0.212843 -0.35953
C  -0.891159 0.851985 0.385662
C  1.499943 -0.24196 0.141946
C  -2.312593 0.800893 -0.209549
C  -2.968714 -0.604729 -0.073245
C  -0.667407 -1.629148 -0.380454
C  1.538343 -0.666181 1.627232
C  -2.138777 -1.62355 -0.879346
C  -0.266695 2.257055 0.243832
C  2.038918 1.200671 0.056205
C  -3.408111 1.786089 0.28016
C  2.306321 -1.208488 -0.78003
C  1.208005 2.284679 0.720083
C  -4.397536 -0.315567 -0.573407
C  -4.705939 1.180807 -0.329052
C  2.610417 -1.483099 2.282436
C  -3.149134 -1.078976 1.405799
C  3.817882 -0.915433 -0.913666
C  3.183337 1.530604 -0.623573
C  4.104459 0.549226 -1.227589
H  0.038587 0.138194 -1.4166
H  -0.953814 0.600188 1.465033
H  -2.199623 0.979939 -1.305368
H  -0.61352 -2.082805 0.623786
H  -0.080091 -2.29211 -1.04134
H  0.982817 0.000665 2.300209
H  -2.174022 -1.351783 -1.953945
H  -2.569127 -2.638609 -0.792919
H  -0.851881 2.997587 0.821288
H  -0.309869 2.566305 -0.82083
H  -3.233844 2.82136 -0.060125
H  -3.45909 1.806286 1.385088
H  1.864972 -1.146081 -1.793746
H  2.154379 -2.247229 -0.434418
H  1.223368 2.144316 1.821681
H  1.658133 3.274482 0.523901
H  -4.949325 1.639944 -1.307015
H  -5.606527 1.291711 0.301121
H  3.445204 -1.880952 1.697403
H  2.811499 -1.339225 3.35133
H  -3.725429 -0.358697 2.014122
H  -3.695573 -2.039031 1.413319
H  -2.177467 -1.238088 1.902625
H  4.268916 -1.541588 -1.703787
H  4.364157 -1.15138 0.02099
H  3.482359 2.582547 -0.721619
