program: Gaussian 09
title: 000188529
version: EM64L-G09RevD.01
frameworkgroup: C1[X(C17H22O3)]
method: RPBEPBE
basis: SDD
operation: Freq
keyword: #pfreq=noraman
keyword: PBEPBE/SDD
title: #p freq=noraman PBEPBE/SDD
converged: YES YES NO NO
title: Mulliken charges:
elementType: O O O C C C C C C C C C C C C C C C C C H H H H H H H H H H H H H H H H H H H H H H
charge: -0.215751 -0.419988 -0.223948 -0.212501 -0.443301 -0.443238 -0.398181 -0.398083 -0.383789 0.553425 -0.414028 -0.478561 -0.374790 -0.355081 0.294243 0.098664 -0.514813 -0.380322 -0.473527 0.170970 0.204795 0.218147 0.196070 0.196318 0.218072 0.194275 0.202816 0.202837 0.194293 0.188417 0.202476 0.232147 0.238615 0.240682 0.275787 0.230124 0.230260 0.239169 0.240084 0.245781 0.245203 0.376232
chargesum: 0.00000
title: Mulliken charges with hydrogens summed into heavy atoms:
elementType: O O O C C C C C C C C C C C C C C C C C
charge: -0.215751 -0.043756 -0.223948 -0.007706 -0.029083 -0.028848 -0.001091 -0.000953 0.007104 0.553425 -0.181881 -0.239946 -0.134108 -0.079293 0.294243 0.098664 -0.054429 0.098930 0.017457 0.170970
polarizability: 2.88691772e+02 1.25080497e+01 1.77625844e+02 -1.37845952e-01 5.84381268e-01 1.23382672e+02
1716.lowfreq: -3.1783 -0.0005 0.0007 0.0010 4.5403 6.4478 14.9119 19.4089 34.4406
frequency: 7.4111 18.7655 34.2371 39.8577 54.0525 70.1751 79.7078 81.6682 114.3361 130.8111 160.2412 180.9168 215.3788 233.1450 255.7681 289.1380 322.0428 350.8575 386.9131 404.8547 433.2607 446.4492 468.3766 481.9484 497.7504 503.5349 509.4151 582.0197 590.5304 632.1124 637.7271 650.1114 731.6456 753.9749 755.4193 782.4309 787.9386 826.6421 827.0758 857.9520 861.5415 869.0948 869.9349 889.7367 893.6124 922.6286 970.0699 976.3488 990.2952 999.4234 1011.5346 1026.8104 1049.5265 1050.3268 1056.1208 1071.0484 1076.4256 1092.5765 1108.8702 1111.7943 1140.4312 1140.5565 1180.2255 1190.7432 1210.7099 1217.0306 1232.3467 1242.8011 1254.5885 1259.2083 1263.2318 1282.6915 1285.6803 1287.7666 1305.3772 1314.1589 1325.5113 1334.3919 1341.1503 1342.9692 1347.4805 1353.4709 1376.4755 1387.8890 1414.2664 1434.0407 1440.1845 1463.3486 1463.7189 1466.3028 1470.8698 1472.0520 1479.4707 1499.7160 1559.8241 1593.5128 1619.5654 1673.5170 2955.6926 2958.4245 2964.7627 2967.3779 2967.6388 2967.8737 2973.6060 2985.2592 3005.4963 3026.2651 3028.5358 3028.6620 3031.9586 3033.1482 3035.3200 3044.8761 3089.7787 3122.7309 3125.0170 3151.2756 3156.8356 3513.3101
redmass: 11.8061 3.9966 3.8222 5.8521 3.3255 3.1365 2.4858 3.9406 2.5069 5.0957 3.8796 5.3396 3.6607 1.7780 7.3931 3.4927 4.4139 1.8807 5.0499 2.8454 3.0789 4.4015 2.8491 3.6257 1.9638 1.8821 2.6741 2.1181 4.7346 6.8924 1.3070 4.7494 1.4723 3.1607 2.7116 3.5386 1.4454 1.5291 3.4780 1.3302 1.7108 3.9695 1.7530 2.4002 1.4018 1.9840 1.3821 4.7627 2.4346 1.3670 2.7705 2.9559 1.8224 1.3878 2.0316 1.2488 2.0830 3.3191 1.6000 2.4348 1.6417 1.3440 1.4486 1.2452 1.9259 1.6537 1.5157 1.6692 1.2123 1.2900 1.2997 1.9516 1.0737 1.4761 1.2395 1.3563 1.3221 1.3704 1.4907 1.6537 1.7451 1.5705 1.8525 3.5795 3.0042 1.1038 1.0851 1.0877 1.0885 1.0884 1.0888 1.0831 1.0990 2.5081 6.8000 7.9227 6.6002 8.3237 1.0800 1.0600 1.0642 1.0646 1.0622 1.0593 1.0651 1.0608 1.0978 1.0968 1.0952 1.0614 1.0984 1.0995 1.1031 1.1034 1.1029 1.0888 1.0873 1.0944 1.0956 1.0639
irintensity: 0.5532 0.1785 1.3787 0.1836 0.8175 1.2493 0.6184 0.1081 1.3454 0.0649 0.0001 0.1090 4.3421 0.0642 3.9856 7.1909 0.0001 1.5700 0.5011 0.0305 0.4764 27.6045 10.6427 30.4306 14.1476 5.7114 23.8742 9.3436 5.5840 0.2988 127.4454 0.3802 29.4492 2.4793 5.1733 1.3480 0.7367 29.3626 5.1245 0.9711 3.5079 5.1493 19.9483 1.6682 1.5072 1.9627 0.1911 39.2135 19.5577 0.7043 21.6326 275.1040 1.0464 0.3913 0.6782 0.0158 8.8669 54.9460 11.1627 0.0025 4.4473 2.6070 1.2864 64.7437 19.4964 9.1620 1.5015 50.0885 0.3660 1.6225 1.1415 222.8372 2.5797 0.8861 0.2949 3.8295 0.0809 0.1885 0.4896 1.5848 5.1528 1.9169 46.3857 8.9106 23.6899 3.2925 31.8615 1.3340 9.0676 10.6355 17.0267 22.1556 1.4905 0.0583 84.8823 137.5745 39.8191 215.8736 6.0303 27.7439 33.5441 46.8861 52.7896 1.6612 37.2049 11.7380 11.2558 89.9992 82.3569 5.7607 4.6906 0.8583 2.4089 123.8502 26.0700 11.0114 21.7413 19.7933 1.8716 19.9752
temp: 298.150 k
press: 1.00000 atm
elementType: 8 8 8 6 6 6 6 6 6 6 6 6 6 6 6 6 6 6 6 6 1 1 1 1 1 1 1 1 1 1 1 1 1 1 1 1 1 1 1 1 1 1
symmnumber: 1
zpe: 926420.6 jmol-1
zpe.correction: 0.352855 hartree
zpe.thermalcorrener: 0.372622 hartree
zpe.thermalcorrenthalpy: 0.373566 hartree
zpe.thermalcorrgfe: 0.300041 hartree
zpe.sumelectzpe: -885.197786 hartree
zpe.sumelectthermal: -885.178019 hartree
zpe.sumelectthermalent: -885.177075 hartree
zpe.sumelectthermalfe: -885.250600 hartree
dipole: -3.8591 -4.1122 -0.0566
dipole: 5.6397
quadrupole: -114.8330 -124.5445 -120.2078
quadrupole: -18.6529 -0.5408 -0.2278
quadrupole: 5.0288 -4.6827 -0.3460 -18.6529 -0.5408 -0.2278
hfenergy: -885.550641 hartree
pointgroup: C01 [X(C17H22O3)]
dipole: 1.5180935 1.6171756 -0.057519 debye
polarizability: 288.6887005|12.5223805|177.5768865|-0.0967029|-1.775713|123.4347002 unknown
InChI: InChI=1S/C17H22O3/c18-16(7-4-8-17(19)20)15-11-9-14(10-12-15)13-5-2-1-3-6-13/h9-13,19H,1-8H2
charge 0 multiplicity 1
42 atoms
O  -2.345177 -2.184621 0.032514
O  -7.441107 1.941386 -0.084973
O  -7.209307 -0.362569 0.085744
C  3.971071 -0.257977 0.011027
C  4.465058 0.517934 1.268872
C  4.481343 0.440574 -1.284944
C  6.003283 0.678114 1.271446
C  6.019606 0.600974 -1.278106
C  6.503456 1.363733 -0.022005
C  2.456669 -0.435484 0.007443
C  1.585032 0.687184 -0.023849
C  1.872203 -1.730241 0.036655
C  0.186661 0.523461 -0.024622
C  0.4755 -1.900771 0.035759
C  -0.391464 -0.775458 0.005605
C  -1.874931 -1.008617 0.007937
C  -2.810451 0.207878 -0.01989
C  -4.301862 -0.172701 -0.001749
C  -5.193127 1.082351 -0.040026
C  -6.675302 0.762874 -0.004278
H  4.433404 -1.267722 0.044763
H  4.129082 -0.007065 2.18378
H  3.993085 1.521839 1.28619
H  4.010195 1.441519 -1.368477
H  4.15648 -0.138577 -2.170738
H  6.475292 -0.322657 1.358885
H  6.318666 1.257653 2.160707
H  6.346024 1.12605 -2.196699
H  6.492735 -0.402796 -1.298951
H  6.119277 2.404705 -0.056079
H  7.608582 1.430575 -0.016975
H  2.005197 1.699525 -0.0469
H  2.526643 -2.610222 0.060818
H  -0.452832 1.412383 -0.048625
H  0.022653 -2.897788 0.058836
H  -2.56637 0.85854 0.845993
H  -2.574888 0.810195 -0.922541
H  -4.532099 -0.831163 -0.857499
H  -4.526348 -0.772782 0.897337
H  -5.002387 1.686873 -0.948765
H  -4.977779 1.754905 0.814422
H  -8.407369 1.701987 -0.055442
