program: Gaussian 09
title: 000188528
version: EM64L-G09RevD.01
frameworkgroup: C1[X(C15H19ClO4)]
method: RPBEPBE
basis: SDD
operation: Freq
keyword: #p
keyword: freq=noraman
keyword: PBEPBE/SDD
title: #p freq=noraman PBEPBE/SDD
converged: YES YES NO NO
title: Mulliken charges:
elementType: Cl O O O O C C C C C C C C C C C C C C C H H H H H H H H H H H H H H H H H H H
charge: -0.027290 -0.243835 -0.233376 -0.416884 -0.238772 -0.095876 -0.144371 -0.558664 -0.285254 0.116711 0.320733 -0.689727 -0.695614 -0.710544 0.477814 -0.294304 -0.382091 0.151455 -0.370480 -0.339237 0.224855 0.282159 0.280159 0.238495 0.219100 0.206351 0.215178 0.196579 0.252942 0.227953 0.213674 0.206205 0.250087 0.247341 0.206124 0.274840 0.279639 0.259742 0.378185
chargesum: 0.00000
title: Mulliken charges with hydrogens summed into heavy atoms:
elementType: Cl O O O O C C C C C C C C C C C C C C C
charge: -0.027290 -0.243835 -0.233376 -0.038699 -0.238772 0.128979 0.137788 -0.040010 0.140197 0.116711 0.320733 -0.025029 -0.047781 -0.006992 0.477814 -0.019464 -0.102452 0.151455 -0.370480 -0.079495
polarizability: 2.93495810e+02 1.13809238e+01 1.86316309e+02 -1.66092262e+00 4.85264421e-01 1.12679370e+02
1716.lowfreq: -2.9961 -0.0025 -0.0014 -0.0005 2.6405 7.4818 16.7212 24.7040 38.1504
frequency: 16.7022 24.6976 38.1407 41.6819 45.3157 57.9916 77.7396 84.5081 107.4338 152.2782 161.5504 167.7145 170.8219 198.8603 208.4322 215.5548 239.6035 244.1798 299.8595 307.1229 315.3649 330.1009 359.9083 362.7956 385.9609 426.1650 441.6006 464.4875 502.1044 512.8403 543.2550 555.4860 602.6341 608.0473 626.0205 685.9334 693.9110 730.6489 748.9100 815.6486 826.2525 833.1887 851.8168 871.6387 907.8141 914.1802 923.9618 930.0367 946.6277 971.1750 976.4627 982.5680 1008.9979 1032.8263 1035.4628 1067.4826 1079.2542 1134.5835 1146.4773 1150.6705 1153.2165 1191.0801 1217.1885 1226.5298 1235.9701 1244.8805 1252.4153 1270.7214 1292.2932 1299.9111 1310.8327 1345.3743 1353.7315 1364.2493 1369.5168 1380.1839 1386.2149 1399.4479 1414.9296 1440.2088 1461.1756 1470.6833 1472.8124 1477.3417 1483.3145 1483.6763 1489.6120 1493.2479 1545.6973 1577.3954 1613.5341 1647.8960 2951.2847 2972.9340 2976.5309 2979.6934 2986.4415 2994.9988 2995.8664 3024.6028 3034.2323 3063.7150 3071.6225 3081.7191 3091.8293 3095.9672 3115.7894 3153.2928 3169.4261 3172.8813 3514.4341
redmass: 5.6642 6.8732 4.1635 5.1283 3.6604 3.6252 4.5847 5.6268 4.6523 3.8077 4.6717 5.0119 4.0525 3.0353 1.1497 1.2623 2.2782 1.2554 3.4114 6.7418 3.7868 6.3395 2.3138 5.1806 3.2142 2.1480 3.0984 4.8469 3.6287 4.0521 3.9443 4.2661 1.5621 2.7751 5.7910 7.0930 3.2666 3.8073 5.8876 3.3091 1.5498 2.4942 4.1827 1.6395 1.9964 1.4333 1.1998 1.8667 1.7053 1.8349 3.1067 1.3541 2.7719 2.3601 3.0260 1.9593 1.9378 1.9165 1.4933 1.5195 1.9145 1.7743 1.6744 1.3097 1.3045 1.6180 3.1965 1.4548 1.5184 1.3621 2.1670 1.4282 2.5731 2.4826 1.6550 1.2088 1.2136 1.2393 5.3776 1.1214 1.1049 1.0501 1.1058 1.0653 1.0522 1.0497 1.5459 1.3942 7.6532 7.6993 7.4527 8.7196 1.0551 1.0362 1.0386 1.0641 1.0727 1.0414 1.0845 1.1064 1.0973 1.0991 1.0986 1.0987 1.0988 1.0995 1.1004 1.0877 1.0922 1.0956 1.0640
irintensity: 0.4351 0.5848 0.6864 0.3038 0.1450 0.6790 3.1261 1.0509 0.3558 5.1401 4.4062 5.4730 1.3090 2.7095 0.8180 0.5267 0.2796 0.5951 0.7935 0.0914 1.1317 2.6798 5.4710 1.8075 2.0817 2.8001 2.4784 5.2454 0.1486 70.2499 54.5206 4.1168 92.0453 6.3105 14.0763 37.0749 46.1911 3.3945 6.4203 7.9210 43.6399 6.1475 10.2345 17.5264 3.1223 3.9512 2.8352 16.3415 23.7047 38.7398 105.6700 0.8789 32.4428 325.6839 79.7367 32.5554 29.2590 10.1419 22.5798 17.0833 4.4282 11.9990 89.1705 11.9092 33.1590 30.8352 426.3321 29.9897 103.9048 0.6689 202.7673 0.8767 0.0133 71.1769 9.4251 21.6931 15.0543 29.5843 2.0936 31.7764 19.6661 3.8428 18.5092 5.7503 24.8859 11.3817 52.3517 3.9391 90.5294 225.2910 97.6594 193.5997 27.4885 34.2961 30.7716 15.7868 33.1322 26.7260 6.4518 32.5223 8.5378 23.2395 64.7109 47.2853 19.3257 29.8955 21.1547 1.4475 4.6261 7.3709 26.6637
temp: 298.150 k
press: 1.00000 atm
elementType: 17 8 8 8 8 6 6 6 6 6 6 6 6 6 6 6 6 6 6 6 1 1 1 1 1 1 1 1 1 1 1 1 1 1 1 1 1 1 1
symmnumber: 1
zpe: 813317.3 jmol-1
zpe.correction: 0.309776 hartree
zpe.thermalcorrener: 0.331532 hartree
zpe.thermalcorrenthalpy: 0.332476 hartree
zpe.thermalcorrgfe: 0.255888 hartree
zpe.sumelectzpe: -1342.443991 hartree
zpe.sumelectthermal: -1342.422236 hartree
zpe.sumelectthermalent: -1342.421292 hartree
zpe.sumelectthermalfe: -1342.497880 hartree
dipole: 3.0458 -1.4952 0.6955
dipole: 3.4636
quadrupole: -100.3480 -134.9668 -126.9577
quadrupole: -13.2647 -4.3328 1.8294
quadrupole: 20.4095 -14.2093 -6.2002 -13.2647 -4.3328 1.8294
hfenergy: -1342.7537676 hartree
pointgroup: C01 [X(C15H19Cl1O4)]
dipole: 1.2141496 0.5735113 -0.232016 debye
polarizability: 292.9001969|-13.5896271|186.689941|4.5019243|2.7360562|112.9013513 unknown
InChI: InChI=1S/C15H19ClO4/c1-9(2)8-20-14-5-4-11(7-12(14)16)13(17)6-10(3)15(18)19/h4-5,7,9-10,18H,6,8H2,1-3H3
charge 0 multiplicity 1
39 atoms
Cl 1.76761 -2.847322 -0.074411
O  3.544916 -0.506136 0.244304
O  -2.360264 2.12426 0.34252
O  -6.823745 -0.233284 -0.017116
O  -5.289691 -1.803886 0.71669
C  5.955845 -0.199782 0.30859
C  -4.484392 0.372804 -0.17779
C  -3.05927 -0.187796 -0.005792
C  4.602999 0.523435 0.375176
C  -2.01171 0.913739 0.181801
C  -0.565791 0.53208 0.195131
C  6.140798 -0.919908 -1.045773
C  7.089298 0.819691 0.574279
C  -4.734687 0.928201 -1.605174
C  2.221488 -0.102489 0.237561
C  -0.130434 -0.817522 0.069155
C  0.41217 1.550191 0.345334
C  -5.513422 -0.676921 0.216282
C  1.235452 -1.11926 0.091426
C  1.782633 1.24477 0.365921
H  5.963236 -0.958907 1.11582
H  -4.607953 1.223551 0.52416
H  -3.02421 -0.866568 0.870519
H  -2.792538 -0.817189 -0.876997
H  4.477847 1.049222 1.343673
H  4.506221 1.254959 -0.454427
H  7.09536 -1.476305 -1.063495
H  6.159201 -0.189908 -1.878544
H  5.319038 -1.632979 -1.228326
H  8.070963 0.314347 0.551108
H  6.983205 1.307029 1.561793
H  7.102972 1.610655 -0.200283
H  -5.753145 1.338366 -1.694491
H  -4.010917 1.734573 -1.810552
H  -4.609557 0.136131 -2.366415
H  -0.847357 -1.635687 -0.041426
H  0.06576 2.583736 0.446041
H  2.514364 2.048777 0.482251
H  -7.460291 -0.939067 0.279675
