program: Gaussian 09
title: 000188527
version: EM64L-G09RevD.01
frameworkgroup: C1[X(C14H18O4)]
method: RPBEPBE
basis: SDD
operation: Freq
keyword: #pfreq=noraman
keyword: PBEPBE/SDD
title: #p freq=noraman PBEPBE/SDD
converged: YES YES NO NO
title: Mulliken charges:
elementType: O O O O C C C C C C C C C C C C C C H H H H H H H H H H H H H H H H H H
charge: -0.271201 -0.238171 -0.417193 -0.240845 -0.144001 -0.551020 0.111506 0.294931 -0.711608 0.021318 0.378661 0.150123 -0.352836 -0.336807 -0.382362 -0.390496 -0.688159 -0.688782 0.282809 0.274477 0.234459 0.248568 0.250034 0.204105 0.200134 0.247243 0.278965 0.241378 0.255507 0.216073 0.243861 0.231789 0.206727 0.236771 0.227409 0.376634
chargesum: 0.00000
title: Mulliken charges with hydrogens summed into heavy atoms:
elementType: O O O O C C C C C C C C C C C C C C
charge: -0.271201 -0.238171 -0.040560 -0.240845 0.138807 -0.042084 0.111506 0.294931 -0.008901 0.221452 0.378661 0.150123 -0.105593 -0.057842 -0.140983 -0.134989 0.003565 -0.017875
polarizability: 2.67900630e+02 1.47078887e+01 1.56473579e+02 7.55107723e-01 1.09788573e+00 1.02805701e+02
1716.lowfreq: -8.1475 -2.4769 -0.0010 -0.0006 -0.0004 5.2282 22.7924 27.4131 42.0926
frequency: 22.7845 27.4043 42.0666 47.4171 67.2284 76.0834 94.4220 117.9669 136.5611 176.9615 182.3431 204.6194 221.2180 234.0940 259.3872 274.8194 303.6535 330.0945 353.6863 358.3992 412.7646 414.4971 460.5028 470.8907 491.4929 523.2867 544.4190 573.7741 602.0576 618.5026 631.9387 694.7175 724.6601 736.6137 772.0223 811.5523 833.1693 849.4643 853.1074 891.8638 919.6509 924.8166 927.0535 939.1282 955.2322 991.1499 996.7346 1006.2621 1032.3482 1066.2709 1077.2032 1101.4824 1120.7529 1150.2572 1151.0312 1176.5385 1185.8955 1215.3073 1226.4218 1235.3084 1250.0365 1289.0356 1301.0609 1307.1968 1319.1478 1341.3490 1351.3593 1373.6501 1382.2015 1386.4593 1398.6448 1433.3544 1439.0332 1455.0446 1467.2031 1469.9300 1477.7462 1483.2616 1487.6856 1496.6858 1549.6223 1586.1701 1618.5549 1647.2806 2980.3121 2981.1913 2988.8762 2990.3640 2995.2373 2995.8657 3035.8933 3086.7549 3091.6631 3094.7124 3097.9343 3104.5124 3114.9588 3143.0848 3151.0931 3167.5397 3172.3446 3514.1671
redmass: 6.1850 3.8688 4.9948 5.3198 3.3444 3.5924 3.8678 4.9698 3.7150 1.0599 4.3714 2.5423 1.1595 1.3680 3.2563 5.4897 3.6661 3.3421 3.2578 2.5011 3.2861 3.0354 2.8780 4.3638 3.2917 3.7769 3.7240 2.4881 1.4998 4.6993 5.9705 3.2892 4.6819 3.6276 4.4981 1.3908 2.7212 1.6781 2.6963 2.2377 2.9249 1.9849 1.3414 1.3340 1.3980 3.3613 1.3413 2.1987 2.3243 1.9295 1.9301 1.6864 1.3173 2.0358 1.9650 1.4178 1.8902 1.5949 1.3048 2.5488 1.9251 1.5801 1.3510 1.9996 1.3438 1.3783 2.1525 4.3449 1.2600 1.2153 1.2280 4.4463 1.1064 1.0486 1.0499 1.0507 1.0586 1.0581 1.0631 2.4973 7.1924 8.0852 6.3856 8.6470 1.0847 1.0627 1.0646 1.0359 1.0503 1.0362 1.0977 1.0993 1.0984 1.1004 1.0996 1.1005 1.1007 1.0877 1.0880 1.0951 1.0971 1.0640
irintensity: 1.7196 0.2972 0.3235 0.9709 0.4309 0.7107 3.4591 0.7586 1.4614 0.8757 0.6552 10.6858 0.3336 2.3561 1.8814 0.2417 0.5388 1.3806 5.8982 4.6484 6.2692 1.1671 3.3334 2.9748 1.4341 65.3628 55.0409 9.8374 94.5851 9.3096 12.4264 47.5025 1.4541 0.1071 0.3828 32.6508 5.0230 49.8554 27.9860 0.7021 73.5003 5.4314 7.2436 0.0955 0.2693 14.4481 0.1369 5.5891 375.2557 34.7859 21.0664 104.0626 25.6642 11.3601 2.8585 109.1327 236.7244 25.6328 29.8195 140.6872 92.0315 130.5224 1.4640 191.7246 8.7155 7.2509 10.1039 11.7455 26.4015 15.5712 27.4273 40.1892 24.1226 5.4269 3.4781 9.7534 3.4699 23.7417 12.1262 36.6136 228.4939 112.4345 181.2328 197.1937 25.7969 18.1562 26.8116 15.0993 29.2428 23.1473 9.7207 15.7066 19.8760 27.2632 36.9023 33.2645 20.7170 11.3418 0.1639 14.0594 7.0536 24.6309
temp: 298.150 k
press: 1.00000 atm
elementType: 8 8 8 8 6 6 6 6 6 6 6 6 6 6 6 6 6 6 1 1 1 1 1 1 1 1 1 1 1 1 1 1 1 1 1 1
symmnumber: 1
zpe: 764770.1 jmol-1
zpe.correction: 0.291286 hartree
zpe.thermalcorrener: 0.310358 hartree
zpe.thermalcorrenthalpy: 0.311303 hartree
zpe.thermalcorrgfe: 0.241760 hartree
zpe.sumelectzpe: -843.838505 hartree
zpe.sumelectthermal: -843.819433 hartree
zpe.sumelectthermalent: -843.818488 hartree
zpe.sumelectthermalfe: -843.888031 hartree
dipole: -3.3983 -3.0069 1.1523
dipole: 4.6817
quadrupole: -85.5327 -111.5620 -108.6420
quadrupole: 3.3735 1.0011 -1.5600
quadrupole: 16.3795 -9.6498 -6.7297 3.3735 1.0011 -1.5600
hfenergy: -844.1297909 hartree
pointgroup: C01 [X(C14H18O4)]
dipole: 1.3395748 1.2636461 0.037286 debye
polarizability: 267.5695991|13.247624|150.8059683|-9.1774056|-16.8251559|108.8043427 unknown
InChI: InChI=1S/C14H18O4/c1-9(2)18-12-6-4-11(5-7-12)13(15)8-10(3)14(16)17/h4-7,9-10,16H,8H2,1-3H3
charge 0 multiplicity 1
36 atoms
O  4.25147 -0.536319 -0.232212
O  -1.922995 -2.195578 0.354946
O  -6.117243 0.541124 -0.271264
O  -4.438274 1.652988 -1.413465
C  -3.845437 -0.171522 0.170949
C  -2.372864 0.14842 -0.151255
C  -1.443051 -1.047222 0.096086
C  0.031722 -0.839201 0.001777
C  -4.131534 -0.163171 1.696696
C  4.976002 0.734877 -0.544405
C  2.859935 -0.548818 -0.164114
C  -4.768542 0.772787 -0.584366
C  0.616972 0.409025 -0.339242
C  0.89724 -1.944194 0.25613
C  2.014669 0.564469 -0.423184
C  2.28731 -1.805908 0.177558
C  5.033885 1.626322 0.708065
C  6.357652 0.288066 -1.030452
H  -4.063818 -1.19725 -0.191162
H  -2.276929 0.458491 -1.211426
H  -2.035926 1.01922 0.443489
H  -5.185556 -0.409944 1.901648
H  -3.491724 -0.916425 2.18588
H  -3.912104 0.828048 2.135218
H  4.43844 1.247725 -1.368178
H  -0.016713 1.277136 -0.548962
H  0.440445 -2.905406 0.513276
H  2.428276 1.541045 -0.689544
H  2.959526 -2.647637 0.369277
H  5.560927 2.570216 0.477899
H  4.026745 1.87705 1.082922
H  5.582747 1.109007 1.514335
H  6.97063 1.167942 -1.296024
H  6.268043 -0.360872 -1.917884
H  6.878303 -0.276845 -0.23762
H  -6.682628 1.16295 -0.805089
