program: Gaussian 09
title: 000188525
version: EM64L-G09RevD.01
frameworkgroup: C1[X(C14H22O2)]
method: RPBEPBE
basis: SDD
operation: Freq
keyword: #pfreq=noraman
keyword: PBEPBE/SDD
title: #p freq=noraman PBEPBE/SDD
converged: YES YES NO NO
title: Mulliken charges:
elementType: O O C C C C C C C C C C C C C C H H H H H H H H H H H H H H H H H H H H H H
charge: -0.252459 -0.251778 -0.364664 -0.369977 -0.378304 -0.371941 -0.316335 -0.487097 0.053009 0.284433 -0.089055 -0.753471 -0.292932 -0.446770 -0.134226 -0.668544 0.191476 0.194530 0.222850 0.192628 0.230123 0.210334 0.207388 0.200487 0.222504 0.230583 0.228399 0.233450 0.248094 0.247391 0.244426 0.209232 0.207513 0.228156 0.235243 0.212967 0.217585 0.224751
chargesum: 0.00000
title: Mulliken charges with hydrogens summed into heavy atoms:
elementType: O O C C C C C C C C C C C C C C
charge: -0.252459 -0.251778 0.021342 0.045501 0.062153 0.035934 0.136752 -0.025248 0.053009 0.284433 -0.089055 -0.013559 -0.064776 -0.030025 0.101017 -0.013241
polarizability: 1.90358143e+02 -3.17899210e+01 1.84817679e+02 -9.34408131e+00 6.93928555e+00 1.26342090e+02
1716.lowfreq: -25.1320 -3.2690 -0.5147 -0.0005 0.0001 0.0003 12.2000 14.0082 25.2230
frequency: -24.6181 13.6452 23.0423 32.3071 39.8049 58.0904 65.5220 78.0582 82.4501 101.7545 109.9159 124.8083 136.3724 173.4828 213.6901 226.2653 263.6259 278.9039 283.2525 308.1373 355.4296 381.7619 412.9789 444.1923 465.2923 494.4744 558.8283 568.4932 626.5241 727.8253 743.0685 760.6647 777.3806 794.4004 827.4050 836.2286 866.0707 902.1837 938.4406 951.4217 963.2766 984.0435 1000.7701 1019.8961 1036.1123 1042.2585 1050.4335 1064.6025 1083.8374 1090.0440 1110.0703 1138.1477 1174.6481 1185.2885 1196.0804 1205.3048 1233.3160 1238.8187 1252.5051 1273.4496 1282.0128 1288.0444 1291.4963 1297.3142 1301.0227 1317.6289 1328.4772 1346.7920 1363.3749 1372.1309 1383.2038 1385.6704 1452.6961 1453.6958 1453.9038 1455.4080 1461.6976 1461.8372 1466.6565 1474.5384 1474.7768 1483.9972 1486.4098 1642.8900 1648.8612 2248.1936 2955.2230 2961.5513 2961.9302 2965.5579 2976.2408 2979.8463 2991.5784 2998.2302 3006.2512 3009.5569 3019.4981 3021.1515 3027.0027 3045.3518 3055.5902 3073.3168 3076.3551 3085.0785 3098.2985 3099.7472 3099.8202 3140.8767
redmass: 2.2512 4.4472 4.0613 3.6622 1.2166 3.1615 4.0276 2.0454 2.5461 3.2727 2.3664 2.5444 2.8447 2.2172 1.6572 2.1988 4.1992 2.8848 2.6022 2.9502 3.0216 3.3450 3.1713 4.4834 4.0656 3.7431 3.5278 3.2222 4.3228 1.3556 1.3024 1.4212 1.8411 2.0820 1.7230 1.7599 1.5312 1.6898 3.2284 2.3345 1.0906 1.7645 2.0039 2.4165 4.0065 1.6812 3.0124 1.7472 2.1492 2.8771 1.6321 2.0685 1.5385 2.2809 1.3684 2.9511 1.2851 1.3332 1.2531 1.2301 1.1841 1.3056 1.0858 1.1140 1.2533 1.3354 1.5815 1.4018 1.6227 1.3299 1.2766 1.1987 1.0961 1.0543 1.0868 1.0558 1.0780 1.0783 1.0682 1.0942 1.0430 1.0628 1.1006 6.4771 8.7067 11.7765 1.0590 1.0587 1.0621 1.0605 1.0614 1.0352 1.0598 1.0972 1.0377 1.0992 1.0578 1.1008 1.0971 1.1041 1.1039 1.0892 1.0997 1.1007 1.0953 1.0976 1.1004 1.1018
irintensity: 0.0291 0.2698 0.8390 1.4936 0.3313 1.5503 1.0211 1.8551 0.6741 1.5547 0.1995 1.2611 0.5087 1.0809 1.2074 0.9696 6.8683 11.3242 2.9304 2.6945 1.2866 2.4619 3.2648 2.1481 3.7728 0.7066 1.5504 3.8933 6.7718 6.9402 7.9107 1.2591 24.4083 0.1331 2.5116 1.2807 1.6394 12.2259 25.3973 16.1764 53.9830 10.0413 61.9275 7.7329 40.7294 10.4304 1.4451 3.5617 1.3881 5.1302 0.4685 2.8515 0.7758 5.4165 58.7873 267.1488 1.0891 13.6102 4.7247 1.9752 5.1338 6.7038 1.0131 0.9553 1.1929 12.3134 2.2544 5.9540 6.5983 6.5096 46.4300 8.6696 27.1093 14.6278 7.5688 14.1052 9.9581 1.8977 0.0456 0.0700 11.7432 11.1761 21.1188 0.2581 170.3533 6.1270 11.2663 20.5631 43.0751 25.7865 74.1368 40.1345 23.0020 4.8040 2.5690 21.4979 46.6078 7.0147 11.8500 33.1692 81.3994 20.6287 44.5959 45.8002 9.9089 32.7913 39.7862 9.9577
temp: 298.150 k
press: 1.00000 atm
elementType: 8 8 6 6 6 6 6 6 6 6 6 6 6 6 6 6 1 1 1 1 1 1 1 1 1 1 1 1 1 1 1 1 1 1 1 1 1 1
symmnumber: 1
zpe: 853295.6 jmol-1
zpe.correction: 0.325003 hartree
zpe.thermalcorrener: 0.344492 hartree
zpe.thermalcorrenthalpy: 0.345436 hartree
zpe.thermalcorrgfe: 0.272370 hartree
zpe.sumelectzpe: -695.812717 hartree
zpe.sumelectthermal: -695.793228 hartree
zpe.sumelectthermalent: -695.792284 hartree
zpe.sumelectthermalfe: -695.865350 hartree
dipole: -1.1843 1.2774 0.9536
dipole: 1.9858
quadrupole: -103.9356 -90.9783 -95.4479
quadrupole: 2.6616 1.9584 -3.3514
quadrupole: -7.1483 5.8089 1.3394 2.6616 1.9584 -3.3514
hfenergy: -696.1377198 hartree
pointgroup: C01 [X(C14H22O2)]
dipole: 0.410393 0.5621373 -0.3549386 debye
polarizability: 184.534012|32.1566423|190.804524|-8.8077743|-4.721974|126.1793762 unknown
InChI: InChI=1S/C14H22O2/c1-3-4-5-6-7-8-9-10-11-12-13-16-14(2)15/h4-5H,3,8-13H2,1-2H3
charge 0 multiplicity 1
38 atoms
O  -4.519683 0.993548 -0.280749
O  -5.557765 -0.671713 0.986135
C  -1.464239 -1.336216 -0.775453
C  -0.190987 -1.62031 0.05216
C  -2.400012 -0.313892 -0.087975
C  0.742886 -2.649016 -0.620826
C  -3.656466 -0.043459 -0.925416
C  2.030866 -2.943915 0.202261
C  2.902449 -1.768098 0.381706
C  -5.424724 0.536672 0.684411
C  3.632448 -0.773978 0.508679
C  -6.178159 1.700429 1.292255
C  4.488991 0.353691 0.724561
C  5.718808 2.477334 0.037261
C  4.821455 1.288337 -0.217929
C  4.999947 3.828975 -0.219601
H  -1.172053 -0.95973 -1.778158
H  -2.014244 -2.285697 -0.943008
H  0.366382 -0.676423 0.214193
H  -0.482049 -1.990642 1.057129
H  -2.703356 -0.698898 0.903943
H  -1.85765 0.637369 0.076106
H  1.033259 -2.285741 -1.626237
H  0.200011 -3.604851 -0.766774
H  -3.40869 0.395496 -1.906265
H  -4.251121 -0.965761 -1.057479
H  1.742523 -3.340557 1.197217
H  2.605526 -3.748783 -0.299662
H  -6.459628 2.430853 0.516837
H  -5.529068 2.220086 2.020338
H  -7.072331 1.330802 1.815275
H  6.605261 2.419534 -0.628637
H  6.098494 2.446284 1.076543
H  4.907046 0.462719 1.737611
H  4.405492 1.190423 -1.231972
H  4.623983 3.886538 -1.258019
H  5.689356 4.678243 -0.060175
H  4.137246 3.949748 0.459513
