program: Gaussian 09
title: 000188524
version: EM64L-G09RevD.01
frameworkgroup: C1[X(C16H14O7)]
method: RPBEPBE
basis: SDD
operation: Freq
keyword: #pfreq=noraman
keyword: PBEPBE/SDD
title: #p freq=noraman PBEPBE/SDD
converged: YES YES NO NO
title: Mulliken charges:
elementType: O O O O O O O C C C C C C C C C C C C C C C C H H H H H H H H H H H H H H
charge: -0.237952 -0.454090 -0.316467 -0.396504 -0.320657 -0.431899 -0.414556 0.010881 -0.386343 0.444206 0.133941 -0.052044 0.288493 -0.520779 -0.374984 0.220640 -0.585859 0.172420 -0.335904 -0.537006 0.391987 0.195613 -0.523870 0.252926 0.250062 0.300482 0.234352 0.374404 0.255099 0.240978 0.284801 0.390845 0.380302 0.365420 0.228852 0.227188 0.245023
chargesum: 0.00000
title: Mulliken charges with hydrogens summed into heavy atoms:
elementType: O O O O O O O C C C C C C C C C C C C C C C C
charge: -0.237952 -0.079686 -0.316467 -0.005658 -0.320657 -0.051597 -0.049136 0.010881 0.116645 0.444206 0.133941 -0.052044 0.288493 -0.220297 -0.140633 0.220640 -0.330760 0.172420 -0.094926 -0.252205 0.391987 0.195613 0.177193
polarizability: 2.69088088e+02 -3.17549849e+01 1.96849624e+02 -3.59559462e+00 -7.33217755e+00 1.56080390e+02
1716.lowfreq: -12.0800 -3.7082 -0.0006 -0.0006 0.0001 3.7901 17.5311 30.6950 43.3793
frequency: 16.7065 30.6469 43.3786 81.6848 105.3353 128.2071 140.1166 176.6974 189.7674 205.8128 219.3250 224.5293 227.6724 239.9813 272.3607 284.7799 286.6011 314.5472 327.3362 356.6916 376.1843 400.6750 414.6150 429.3329 439.0869 456.7673 474.7369 491.2930 494.5262 497.7667 530.4555 562.0893 570.9493 584.7081 599.7210 618.6699 625.8357 637.9365 670.9355 697.0403 731.4257 736.9071 759.6520 784.4211 798.1683 812.8643 847.6298 892.1923 898.4401 908.9389 916.3819 922.2474 932.6949 993.3704 994.5123 1029.9095 1038.3893 1061.9965 1096.0662 1117.3918 1118.4381 1133.8508 1145.3410 1151.7223 1172.1197 1195.2514 1205.2832 1214.7607 1238.1161 1260.2567 1270.0324 1290.2434 1306.8922 1338.4758 1366.9202 1388.7103 1397.5657 1422.7278 1436.8787 1447.0150 1458.3509 1462.1336 1465.5966 1468.3870 1475.2267 1496.7198 1553.7094 1582.1082 1594.3171 1628.1274 1657.1416 2890.3419 2967.9421 3014.4734 3058.6530 3128.5816 3129.5937 3147.2374 3155.3721 3166.9548 3177.5651 3202.0295 3468.4765 3515.3627 3578.9155
redmass: 5.5463 6.7769 5.3498 4.1209 6.5994 6.0792 5.3676 5.0677 3.2120 4.5733 6.3328 1.6392 3.2269 5.6103 3.0013 5.5217 7.0186 5.2832 4.9399 5.4965 5.9471 1.1329 4.3272 6.0072 1.6970 2.6086 4.4332 5.7058 1.1195 5.1617 7.0183 8.7829 4.8844 6.1786 3.9532 6.1775 5.1576 4.2763 4.0613 4.0802 4.0454 5.5448 3.6744 4.4265 1.4924 1.6796 1.7109 1.0982 5.9757 1.4764 3.9341 1.4391 3.5336 5.6920 4.5580 3.2778 2.9598 4.6204 3.3320 1.2667 1.8826 2.3150 1.6735 1.3338 1.3829 1.3281 1.6793 1.6322 1.6226 2.8824 3.0714 1.5066 2.2574 1.5958 2.3997 4.2909 3.3682 3.9080 1.2201 3.0462 1.8080 1.9489 1.0569 3.3425 1.1538 2.8712 5.4605 3.8140 7.7912 6.6195 5.3562 1.0710 1.0323 1.0642 1.1045 1.1024 1.1002 1.0871 1.0925 1.0955 1.0917 1.0934 1.0649 1.0645 1.0661
irintensity: 1.1791 0.2650 1.5909 3.1062 2.0074 0.2716 2.5334 1.6048 2.5397 1.8138 3.0648 2.0436 3.8615 8.0028 3.2850 0.7850 6.8007 12.0788 6.1065 23.6555 22.7895 132.5309 34.3778 1.9788 97.4498 31.4687 4.5114 19.6286 145.2330 16.2897 44.7876 0.0838 8.2481 18.8936 1.0061 22.2109 5.3678 6.5744 14.4563 1.7329 1.3307 25.2436 24.3093 10.2294 22.7664 23.0045 76.5116 118.5450 24.3004 11.4975 12.5576 8.7749 54.8427 20.2180 102.0733 73.7170 36.7246 75.8263 38.0048 6.9470 238.9834 123.3022 45.0255 21.9439 2.0810 55.1606 52.8287 249.5194 41.0699 213.9199 37.2240 16.1325 122.4010 93.6303 33.3227 109.7210 81.5424 97.1509 22.2714 118.6954 63.5490 2.2948 13.4859 72.1057 59.5245 183.7601 138.3556 194.3695 31.7749 14.1366 566.7868 247.5611 58.0065 30.6323 41.2375 12.9850 22.6723 6.1809 1.8166 7.5606 4.1424 0.2936 33.1692 88.3841 78.5545
temp: 298.150 k
press: 1.00000 atm
elementType: 8 8 8 8 8 8 8 6 6 6 6 6 6 6 6 6 6 6 6 6 6 6 6 1 1 1 1 1 1 1 1 1 1 1 1 1 1
symmnumber: 1
zpe: 715743.8 jmol-1
zpe.correction: 0.272612 hartree
zpe.thermalcorrener: 0.292874 hartree
zpe.thermalcorrenthalpy: 0.293818 hartree
zpe.thermalcorrgfe: 0.223624 hartree
zpe.sumelectzpe: -1142.993884 hartree
zpe.sumelectthermal: -1142.973623 hartree
zpe.sumelectthermalent: -1142.972679 hartree
zpe.sumelectthermalfe: -1143.042873 hartree
dipole: 0.8608 5.2339 -2.2547
dipole: 5.7636
quadrupole: -126.8689 -122.7689 -134.5868
quadrupole: 11.6262 17.8549 -1.6202
quadrupole: 1.2059 5.3060 -6.5119 11.6262 17.8549 -1.6202
hfenergy: -1143.2664969 hartree
pointgroup: C01 [X(C16H14O7)]
dipole: 0.4155176 2.0144176 -0.95463 debye
polarizability: 267.2258268|-33.770401|198.1795418|-0.6259604|-9.3651742|156.6127337 unknown
InChI: InChI=1S/C16H14O7/c1-22-12-3-2-8(4-10(12)18)16(21)7-23-13-6-9(17)5-11(19)14(13)15(16)20/h2-6,17-19,21H,7H2,1H3
charge 0 multiplicity 1
37 atoms
O  -1.188319 -0.229607 -2.082962
O  0.337861 -3.069949 -0.217382
O  -1.129806 -1.880609 1.768664
O  -3.184777 -0.429398 2.391634
O  4.823573 1.455789 0.304858
O  4.946212 -1.147646 -0.300232
O  -4.926498 2.604328 -0.867082
C  0.011105 -1.653129 -0.376758
C  -0.54314 -1.541374 -1.819367
C  1.248198 -0.761408 -0.143004
C  -1.124073 -1.306045 0.608351
C  -2.123882 -0.357692 0.19424
C  -2.115905 0.191324 -1.132216
C  2.528911 -1.348604 -0.303462
C  1.143743 0.614049 0.172106
C  -3.136595 0.096615 1.124294
C  -3.030085 1.182557 -1.511709
C  3.683959 -0.568211 -0.144507
C  2.30655 1.404955 0.335667
C  -4.058321 1.08914 0.751521
C  -3.98607 1.622758 -0.55401
C  3.573386 0.81574 0.176877
C  4.82521 2.878625 0.648707
H  0.264093 -1.614343 -2.561942
H  -1.28964 -2.342239 -1.980132
H  2.622551 -2.412197 -0.537322
H  0.166232 1.088004 0.300835
H  0.263182 -3.27097 0.756827
H  -3.003365 1.577789 -2.532316
H  2.208183 2.465448 0.586271
H  -4.815379 1.440037 1.454439
H  -2.43714 -1.130425 2.477191
H  5.63476 -0.446783 -0.147977
H  -4.818022 2.927206 -1.796418
H  4.341423 3.048035 1.629507
H  4.311858 3.473475 -0.130722
H  5.885127 3.16705 0.700426
