program: Gaussian 09
title: 000188518
version: EM64L-G09RevD.01
frameworkgroup: C1[X(C16H22BrN3O7S)]
method: RPBEPBE
basis: SDD
operation: Freq
keyword: #p
keyword: freq=noraman
keyword: PBEPBE/SDD
title: #p freq=noraman PBEPBE/SDD
converged: YES YES NO NO
title: Mulliken charges:
elementType: Br S O O O O O O O N N N C C C C C C C C C C C C C C C C H H H H H H H H H H H H H H H H H H H H H H
charge: 0.002286 0.155376 -0.485701 -0.343840 -0.280392 -0.433078 -0.232091 -0.454592 -0.203777 -0.381176 -0.381181 -0.640757 -0.165303 -0.486648 -0.681175 -0.106352 -0.569670 -0.406845 -0.174821 0.295569 0.211374 -0.109227 -0.181382 -0.186039 -0.182550 0.195484 -0.385261 0.184816 0.277453 0.291186 0.326615 0.251230 0.225532 0.364676 0.220579 0.278875 0.220452 0.247708 0.269014 0.251960 0.261962 0.249896 0.363188 0.383235 0.279028 0.306634 0.284652 0.288633 0.382775 0.401670
chargesum: 0.00000
title: Mulliken charges with hydrogens summed into heavy atoms:
elementType: Br S O O O O O O O N N N C C C C C C C C C C C C C C C C
charge: 0.002286 0.155376 -0.102466 -0.343840 -0.280392 -0.050303 -0.232091 -0.052922 -0.203777 -0.016501 -0.017993 -0.055095 0.112150 -0.195462 -0.103330 0.119180 -0.070216 0.061315 0.094193 0.295569 0.211374 0.142733 0.080580 -0.186039 0.067346 0.195484 0.188024 0.184816
polarizability: 3.08923617e+02 1.72766025e+01 2.52225641e+02 -9.22134644e+00 9.71765532e+00 1.94628330e+02
1716.lowfreq: -8.2173 -4.0455 0.0005 0.0010 0.0010 3.8738 6.9066 11.6132 20.2482
frequency: -6.2329 10.3090 20.2070 27.9411 29.5747 37.3357 43.1139 47.6171 48.1283 60.7597 74.0913 79.1331 88.0922 99.4676 113.0265 135.6421 149.3210 161.2314 169.2528 183.1848 199.9524 225.2377 236.9993 260.5736 264.1056 270.8134 274.9565 293.0405 298.2291 305.6083 319.2362 328.4160 339.9342 379.5795 414.9701 447.2568 459.0873 476.1536 489.6031 500.4936 525.2306 529.8703 534.3509 544.6661 575.4239 579.2483 584.3820 587.9378 617.0762 627.4849 646.3971 652.8959 669.5408 692.6614 707.8872 714.7256 729.2751 748.3289 753.9852 771.2278 777.7509 802.1394 808.2954 868.0085 873.1693 876.3959 899.7931 926.0847 945.9868 965.2576 965.4810 979.3531 994.6991 1010.0142 1013.4147 1016.6555 1032.9978 1037.4025 1058.8608 1078.2326 1095.8959 1114.6853 1117.5283 1136.9051 1159.2269 1162.9395 1176.3867 1178.8185 1188.4748 1200.1886 1215.4795 1231.3610 1232.0008 1237.2511 1244.0329 1264.6803 1269.6221 1270.4030 1297.3047 1299.6799 1306.6567 1312.2716 1318.5838 1325.0480 1340.7636 1357.9214 1361.7635 1385.9357 1423.4058 1450.3449 1453.4708 1458.0948 1475.0331 1494.6396 1507.8284 1585.7869 1596.6476 1620.6504 1624.4857 1627.5114 1665.2000 1692.0315 2852.7135 2885.7091 2949.8084 2969.3934 2998.4343 3002.6599 3014.1843 3019.8260 3039.0719 3074.8093 3092.5956 3107.9965 3148.9909 3162.2100 3175.0441 3197.9093 3405.6592 3467.3927 3518.4930 3535.8482 3538.6911 3602.3721
redmass: 6.4741 10.6968 6.5784 5.4164 7.5353 6.1624 7.1958 7.5972 6.5443 7.6999 7.4606 5.1473 7.2860 7.2996 6.0168 8.1167 5.3239 7.1263 3.2342 5.5799 6.4859 6.5322 6.1303 5.2205 3.9246 7.7024 3.1612 2.5325 2.5879 4.2134 2.0989 4.4362 3.9335 3.5238 3.8327 2.8897 3.3132 3.1031 2.7152 3.0346 4.4370 5.0704 4.0029 4.2487 4.0870 5.4529 1.6436 3.7842 1.2227 1.3344 3.5587 1.4608 3.3797 3.5374 3.4191 2.9468 1.7235 1.1926 1.4895 2.7766 3.6124 1.4552 3.7976 2.4845 2.9093 2.4703 4.2144 3.3109 3.3600 1.8536 1.5841 2.0381 3.1332 2.4004 2.6096 2.7084 4.2003 2.8795 2.7708 2.1227 3.0745 2.1789 1.8414 2.5795 1.2538 1.2279 1.1867 1.1766 1.4826 1.4837 1.0856 1.3760 1.5465 1.2454 1.3153 1.5681 1.4873 1.5742 1.2896 1.5979 1.7365 1.4100 1.2810 1.5218 1.7132 1.5909 1.5203 1.7970 1.3064 1.0872 1.0929 1.0826 1.1445 2.2986 2.0937 7.6355 9.7628 5.7530 7.1354 1.0966 9.0438 9.3900 1.0778 1.0801 1.0817 1.0830 1.0602 1.0627 1.0639 1.0615 1.0999 1.1007 1.0997 1.1027 1.0863 1.0932 1.1005 1.0717 1.0775 1.0449 1.0641 1.0651 1.0778 1.0990
irintensity: 0.4155 0.0925 0.3384 0.3885 0.0518 1.2458 3.7730 3.0156 0.4774 0.6474 1.1311 2.2696 0.5048 0.2360 3.2124 5.7112 3.1150 18.7065 2.7688 22.0906 1.2696 0.1866 3.5279 11.6239 0.9446 9.5150 5.0974 10.0404 18.2870 1.7562 6.6548 6.5691 11.5948 6.0634 24.1387 12.9394 22.1608 27.6004 71.3992 21.9349 14.6709 7.8234 8.4655 39.3694 24.1541 7.2463 19.1798 10.4023 43.4927 370.0430 12.4858 224.4475 27.7134 12.8615 11.6115 10.2172 31.5645 123.8029 119.5603 31.1128 2.5818 38.3186 12.9980 5.5179 23.3970 32.6829 27.4810 1.4949 4.1121 3.8066 3.9180 0.7202 74.1033 5.6513 8.1205 68.0994 41.6155 125.0019 159.1642 215.8405 7.3968 11.1227 2.7902 13.7077 14.6388 4.6111 3.3171 2.0585 5.8383 12.5092 0.0426 2.3193 24.2280 41.0394 8.8162 7.2359 30.5373 10.7190 5.7313 31.1118 36.9591 8.6349 4.6418 3.3661 11.2301 50.8318 9.5583 17.9657 24.5757 15.2889 31.4046 24.0286 35.3345 886.4578 30.4636 227.1941 10.3488 73.3101 52.0939 50.4167 205.9306 278.0623 23.1934 24.8707 20.1987 12.1897 23.0797 15.1854 23.3475 55.2899 2.7411 21.5858 6.3986 1.1873 0.0907 4.2907 19.8184 638.5233 181.3827 4.0669 27.3610 22.7837 93.3218 6.9966
temp: 298.150 k
press: 1.00000 atm
elementType: 35 16 8 8 8 8 8 8 8 7 7 7 6 6 6 6 6 6 6 6 6 6 6 6 6 6 6 6 1 1 1 1 1 1 1 1 1 1 1 1 1 1 1 1 1 1 1 1 1 1
symmnumber: 1
zpe: 994820.6 jmol-1
zpe.correction: 0.378907 hartree
zpe.thermalcorrener: 0.408435 hartree
zpe.thermalcorrenthalpy: 0.409379 hartree
zpe.thermalcorrgfe: 0.313375 hartree
zpe.sumelectzpe: -1723.105444 hartree
zpe.sumelectthermal: -1723.075916 hartree
zpe.sumelectthermalent: -1723.074972 hartree
zpe.sumelectthermalfe: -1723.170977 hartree
dipole: 3.4454 -1.6160 2.3638
dipole: 4.4799
quadrupole: -165.9435 -191.4047 -192.0942
quadrupole: -11.2618 12.5467 -5.5119
quadrupole: 17.2040 -8.2572 -8.9467 -11.2618 12.5467 -5.5119
hfenergy: -1723.4843512 hartree
pointgroup: C01 [X(C16H22Br1N3O7S1)]
dipole: 1.3910365 -0.212319 -1.0613607 debye
polarizability: 272.9051185|-32.2452134|287.9184313|4.2700235|13.9710147|194.9540385 unknown
InChI: InChI=1S/C16H22BrN3O7S/c17-8-1-3-11(21)12(5-8)28-7-10(15(25)19-6-14(23)24)20-13(22)4-2-9(18)16(26)27/h1,3,5,9-12,19-21,23,26H,2,4,6-7,18H2
charge 0 multiplicity 1
50 atoms
Br -0.736554 6.091348 1.618424
S  0.725946 0.774229 0.529847
O  -1.145896 1.291789 -2.248393
O  -1.423332 -1.28405 -1.516711
O  2.397083 -2.950077 1.079644
O  -5.850874 0.0499 0.472171
O  -5.335186 -2.209736 0.485297
O  6.075701 -1.154278 -1.505508
O  7.462463 -2.197056 0.049058
N  0.192693 -2.246409 -0.148348
N  3.8325 -1.944167 -0.431664
N  -3.603557 0.571798 1.907141
C  1.386121 -1.700433 -0.799485
C  0.112215 2.347404 -0.38167
C  1.407825 -0.155154 -0.978485
C  -1.264821 2.122782 -1.057598
C  -2.158713 -2.665996 0.379261
C  -2.663954 -1.679863 1.472648
C  0.108801 3.497535 0.61665
C  -1.105463 -2.018799 -0.516337
C  2.581162 -2.24396 0.036537
C  -3.54918 -0.531374 0.930554
C  -1.90015 3.450315 -1.447041
C  -0.749784 4.534863 0.413952
C  -1.689765 4.583913 -0.718353
C  -4.964185 -1.025397 0.630275
C  5.02601 -2.403887 0.28334
C  6.318036 -1.935283 -0.36234
H  1.473029 -2.121587 -1.825044
H  0.869114 2.54133 -1.170942
H  0.778679 0.137093 -1.831236
H  2.441005 0.19229 -1.155873
H  -1.937452 1.638604 -0.308289
H  0.413631 -2.815897 0.682927
H  -1.740297 -3.562295 0.873036
H  -3.006699 -2.991673 -0.245312
H  -1.79623 -1.227327 1.989266
H  -3.237736 -2.243653 2.228407
H  0.856156 3.503123 1.415578
H  -3.146275 -0.227728 -0.069511
H  -2.584539 3.425019 -2.301611
H  -2.193435 5.525618 -0.955427
H  3.979759 -1.380355 -1.272199
H  -1.315261 0.321573 -2.026292
H  -2.685521 0.968985 2.127499
H  -4.319632 1.276515 1.710247
H  5.050753 -3.509188 0.343209
H  5.014898 -2.052264 1.333001
H  -6.757582 -0.29782 0.253985
H  6.934692 -0.857719 -1.908988
